1,3-Dioxane clathrate hydrate

Condensed phase thermochemistry data

Data compiled by: Eugene S. Domalski and Elizabeth D. Hearing

Constant pressure heat capacity of liquid

Cp,liquid (J/mol*K) Temperature (K) Reference Comment
745.250.Handa, 1985T = 95 to 250 K.

References

Handa, 1985
Handa, Y.P., Heat capacities in the range 95 to 260 K and enthalpies of fusion for structure-II clathrate hydrates of some cyclic ethers, J. Chem. Thermodynam., 1985, 17, 201-208. [all data]