1,1-(Dimethylthio)ethene

Gas phase ion energetics data

Data evaluated as indicated in comments:
HL - Edward P. Hunter and Sharon G. Lias

Data compiled as indicated in comments:
LLK - Sharon G. Lias, Rhoda D. Levin, and Sherif A. Kafafi

Quantity Value Units Method Reference Comment
Proton affinity (review)931.1kJ/molN/AHunter and Lias, 1998HL
Quantity Value Units Method Reference Comment
Gas basicity902.2kJ/molN/AHunter and Lias, 1998HL

Ionization energy determinations

IE (eV) Method Reference Comment
8.2PEBock, Wagner, et al., 1974Vertical value; LLK

References

Hunter and Lias, 1998
Hunter, E.P.; Lias, S.G., Evaluated Gas Phase Basicities and Proton Affinities of Molecules: An Update, J. Phys. Chem. Ref. Data, 1998, 27, 3, 413-656, https://doi.org/10.1063/1.556018 . [all data]

Bock, Wagner, et al., 1974
Bock, H.; Wagner, G.; Wittel, K.; Sauer, J.; Seebach, D., Photoelektronenspektren und molekuleigenschaften. XXXII. n/π-konjugation in heterosubstituierten athylenen, Chem. Ber., 1974, 107, 1869. [all data]