15-Azatricyclo[8.2.2.14,7]pentadeca-4,6,10,12,13-pentaene

Gas phase ion energetics data

Data compiled by: Sharon G. Lias, Rhoda D. Levin, and Sherif A. Kafafi

Ionization energy determinations

IE (eV) Method Reference
7.26PEKovac, Allan, et al., 1980

References

Kovac, Allan, et al., 1980
Kovac, B.; Allan, M.; Heilbronner, E.; Maier, J.P.; Gleiter, R.; Haenel, M.W.; Keehn, P.M.; Reiss, J.A., He(Iα) photoelectron spectra of [2.2]cyclophanes, J. Electron Spectrosc. Relat. Phenom., 1980, 19, 167. [all data]