Pyrene, 1-phenyl-

Lee's RI, non-polar column, custom temperature program

Data compiled by: NIST Mass Spectrometry Data Center, William E. Wallace, director

Column type CapillaryCapillaryCapillary
Active phase HP-5MSHP-5MSHP-5
Column length (m) 30.30.25.
Carrier gas HeHeHe
Substrate
Column diameter (mm) 0.250.250.2
Phase thickness (μm) 0.250.250.11
Program 60C(2min) => 6C/min => 258C => 2C/min => 300C(4min)not specified106C(0.2min) => 40C/min => 120C => 3C/min => 310C(10min)
I 486.34486.34457.93
ReferenceWang, Li, et al., 2007Wang, Li, et al., 2007, 2Reckendorf, 1997
Comment MSDC-RI MSDC-RI MSDC-RI

References

Wang, Li, et al., 2007
Wang, Z.; Li, K.; Lambert, P.; Yang, C., Identification, characterization and quantitation of pyrogenic polycylic aromatic hydrocarbons and other organic compounds in tire fire products, J. Chromatogr. A, 2007, 1139, 1, 14-26, https://doi.org/10.1016/j.chroma.2006.10.085 . [all data]

Wang, Li, et al., 2007, 2
Wang, Z.; Li, K.; Lambert, P.; Brown, C.E.; Yang, C.; Hollebone, B.P., Identification and characterization of polycyclic aromatic compounds in tire fire products and differentiation of pyrogenic PAHs from petrogenic PAHs in Proceedings of the 30th Arctic and Marine Oilspill (AMOP) Technical Seminar. Vol.1, 2007, 61-85. [all data]

Reckendorf, 1997
Reckendorf, R.M., Identification of phenyl-substituted polycyclic aromatic compounds in ring furnace gases using GC-MS and GC-AED, Chromatographia, 1997, 45, 1, 173-182, https://doi.org/10.1007/BF02505557 . [all data]