Di-epi-α-cedrene

Normal alkane RI, non-polar column, temperature ramp

Data compiled by: NIST Mass Spectrometry Data Center, William E. Wallace, director

Column type CapillaryCapillaryCapillaryCapillaryCapillary
Active phase DB-5CP-Sil 5 CBZB-1HP-5HP-5
Column length (m) 30.30.30.25.30.
Carrier gas NitrogenNitrogenNitrogenHeHe
Substrate
Column diameter (mm) 0.250.250.250.250.25
Phase thickness (μm)  0.250.250.250.25
Tstart (C) 60.50.45.50.70.
Tend (C) 250.200.230.300.240.
Heat rate (K/min) 4.5.3.5.5.
Initial hold (min) 1.  5.
Final hold (min) 10.
I 1427.1394.1387.1385.1400.
ReferenceYousefzadi, Heidari, et al., 2011Hnawia, Menut, et al., 2009Mierendorff, Stahl-Biskup, et al., 2008Champagnat, Figueredo, et al., 2006Oyedeji, Yani, et al., 2005
Comment MSDC-RI MSDC-RI MSDC-RI MSDC-RI MSDC-RI
Column type CapillaryCapillaryCapillary
Active phase DB-5ZB-1MDN-5
Column length (m) 50.30.30.
Carrier gas HeN2
Substrate
Column diameter (mm) 0.20.250.25
Phase thickness (μm) 0.250.250.25
Tstart (C) 50.45.40.
Tend (C) 220.230.280.
Heat rate (K/min) 3.3.8.
Initial hold (min) 2. 3.
Final hold (min) 10.
I 1405.1387.1399.
ReferenceJuteau, Jerkovic, et al., 2003Mierendorff, Stahl-Biskup, et al., 2003Jelén, 2002
Comment MSDC-RI MSDC-RI MSDC-RI

References

Yousefzadi, Heidari, et al., 2011
Yousefzadi, M.; Heidari, M.; Akbarpour, M.; Mirjalili, M.H.; Zainali, A.; Parsa, M., in vitro cytotoxic activity of the essential oil of Dorema ammoniacum D. Don., Middle-East J. Sci. Res., 2011, 7, 4, 511-514. [all data]

Hnawia, Menut, et al., 2009
Hnawia, E.; Menut, C.; Agrebi, A.; Cabalion, P., Wood essential oil of two endemic trees from New Caledonia: Callitris sulcata (Parl.) Schltr. and Callitris neocaledonica Dummer, Biochem. Systematics Ecol., 2009, 36, 11, 859-866, https://doi.org/10.1016/j.bse.2008.08.007 . [all data]

Mierendorff, Stahl-Biskup, et al., 2008
Mierendorff, H.-G.; Stahl-Biskup, E.; Posthumus, M.A.; van Beek, T.A., Composition of commercial Cape chamomile oil (Eriocephalus punctuatus / Eriocephalus tenuifolius), 2008, retrieved from http://www.chemische-analysen-hamburg.de/Publikationen?CapeChamomileOil/. [all data]

Champagnat, Figueredo, et al., 2006
Champagnat, P.; Figueredo, G.; Chalchat, J.-C.; Bessiere, J.-M., Essential oil composition of Vetiveria nigritana from Mali, J. Essent. Oil Res., 2006, 18, 6, 647-649, https://doi.org/10.1080/10412905.2006.9699193 . [all data]

Oyedeji, Yani, et al., 2005
Oyedeji, O.A.; Yani, V.V.; Afolayan, A.J., Chemical composition of the essential oil from Arctotis arctotoides (L.F.) O. Hoffm. (syn. Vendium arctotoides Less.), Flavour Fragr. J., 2005, 20, 2, 232-234, https://doi.org/10.1002/ffj.1437 . [all data]

Juteau, Jerkovic, et al., 2003
Juteau, F.; Jerkovic, I.; Masotti, V.; Milos, M.; Mastelic, J.; Bessière, J.-M.; Viano, J., Composition and antimicrobial activity of the essential oil of Artemisia absinthium from Croatia and France, Planta Medica, 2003, 69, 2, 158-161, https://doi.org/10.1055/s-2003-37714 . [all data]

Mierendorff, Stahl-Biskup, et al., 2003
Mierendorff, H.-G.; Stahl-Biskup, E.; Posthumus, M.A.; van Beek, T.A., Composition of commercial Cape chamomile oil (Eriocephalus punctulatus), Flavour Fragr. J., 2003, 18, 6, 510-514, https://doi.org/10.1002/ffj.1259 . [all data]

Jelén, 2002
Jelén, H.H., Volatile sesquiterpene hydrocarbons characteristic for Penicillium roqueforti strains producing PR toxin, J. Agric. Food Chem., 2002, 50, 22, 6569-6574, https://doi.org/10.1021/jf020311o . [all data]