Pyrazine, 2-butyl-3,5-dimethyl-

Normal alkane RI, non-polar column, temperature ramp

View large format table.

Column type Active phase I Reference Comment
CapillaryOV-1011196.Mihara and Masuda, 1987N2, 2. K/min; Column length: 50. m; Column diameter: 0.22 mm; Tstart: 80. C; Tend: 200. C

Normal alkane RI, non-polar column, custom temperature program

View large format table.

Column type Active phase I Reference Comment
CapillaryHP-51254.Characterization of Pyrazines in Some Chinese Liquors and Their Approximate Concentrations, 200730. m/0.25 mm/0.25 μm, He; Program: 50C(2min) => 2C/min => 140C => 10C/min => 280C (10min)

Normal alkane RI, polar column, temperature ramp

View large format table.

Column type Active phase I Reference Comment
CapillaryDB-Wax1583.Characterization of Pyrazines in Some Chinese Liquors and Their Approximate Concentrations, 200730. m/0.25 mm/0.25 μm, He, 4. K/min, 230. C @ 15. min; Tstart: 50. C
CapillaryDB-Wax1583.Fan and Qian, 200630. m/0.32 mm/0.25 μm, He, 40. C @ 2. min, 4. K/min, 230. C @ 15. min

References

Mihara and Masuda, 1987
Mihara, S.; Masuda, H., Correlation between molecular structures and retention indices of pyrazines, J. Chromatogr., 1987, 402, 309-317, https://doi.org/10.1016/0021-9673(87)80029-8 . [all data]

Characterization of Pyrazines in Some Chinese Liquors and Their Approximate Concentrations, 2007
Characterization of Pyrazines in Some Chinese Liquors; Their Approximate Concentrations, W. Fan; Y. Xu; Y. Zhang, J. Agric. Food Chem., 2007, 55, 9956-9962. [all data]

Fan and Qian, 2006
Fan, W.; Qian, M.C., Characterization of Aroma Compounds of Chinese Wuliangye and Jiannanchun Liquors by Aroma Extract Dilution Analysis, J. Agric. Food Chem., 2006, 54, 7, 2695-2704, https://doi.org/10.1021/jf052635t . [all data]