Bicyclo[8.2.2]tetradeca-5,10,12,13-tetraene, (Z)-

Gas phase ion energetics data

Data compiled as indicated in comments:
LLK - Sharon G. Lias, Rhoda D. Levin, and Sherif A. Kafafi

Ionization energy determinations

IE (eV) Method Reference Comment
8.37PEGleiter, Hopf, et al., 1980Vertical value; LLK

References

Gleiter, Hopf, et al., 1980
Gleiter, R.; Hopf, H.; Eckert-Maksic, M.; Noble, K.-L., Photoelektronenspektren von [8]paracyclophan und [8]paracyclophan-4-en. Eine ermittlung des induktiven und hyperkonjugativen effekts fur [n]Ppracyclophane, Chem. Ber., 1980, 113, 3401. [all data]