2-Pentenoic acid, 3-methyl-, methyl ester

Normal alkane RI, non-polar column, custom temperature program

View large format table.

Column type Active phase I Reference Comment
CapillaryDB-1926.Marlatt, Ho, et al., 199230. m/0.25 mm/0.25 μm; Program: not specified

Normal alkane RI, polar column, temperature ramp

View large format table.

Column type Active phase I Reference Comment
CapillaryHP-Innowax1262.Wijaya, Ulrich, et al., 200515. m/0.25 mm/1. μm, 45. C @ 5. min, 10. K/min, 210. C @ 5. min
CapillaryTC-Wax1252.Suhardi, Suzuki, et al., 200260. m/0.25 mm/0.25 μm, He, 40. C @ 10. min, 3. K/min, 230. C @ 10. min

References

Marlatt, Ho, et al., 1992
Marlatt, C.; Ho, C.-T.; Chien, M., Studies of aroma constituents bound as glycosides in tomato, J. Agric. Food Chem., 1992, 40, 2, 249-252, https://doi.org/10.1021/jf00014a016 . [all data]

Wijaya, Ulrich, et al., 2005
Wijaya, C.H.; Ulrich, D.; Lestari, R.; Schippel, K.; Ebert, G., Identification of potent odorants in different cultivars of snake fruit [Salacca zalacca (Gaert.) Voss] using gas chromatography-olfactometry, J. Agric. Food Chem., 2005, 53, 5, 1637-1641, https://doi.org/10.1021/jf048950h . [all data]

Suhardi, Suzuki, et al., 2002
Suhardi, S.; Suzuki, M.; Yoshida, K.; Muto, T.; Fujita, A.; Watanbe, N., Changes in the volatile compounds and in the chemical and physical properties of snake fruit (Salacca edulis Reinw) Cv. Pondoh during maturation, J. Agric. Food Chem., 2002, 50, 26, 7627-7633, https://doi.org/10.1021/jf020620e . [all data]