1-Fluoroundecane

Phase change data

Data compiled by: William E. Acree, Jr., James S. Chickos

Enthalpy of vaporization

ΔvapH (kcal/mol) Temperature (K) Method Reference Comment
12.5388.A,EStephenson and Malanowski, 1987Based on data from 373. - 523. K. See also Li and Rossini, 1961 and Dykyj and Vanko, 1970.

References

Stephenson and Malanowski, 1987
Stephenson, Richard M.; Malanowski, Stanislaw, Handbook of the Thermodynamics of Organic Compounds, 1987, https://doi.org/10.1007/978-94-009-3173-2 . [all data]

Li and Rossini, 1961
Li, J.C.M.; Rossini, F.D., Vapor Pressures and Boiling Points of the l-Fluoroalkanes, l-Chloroalkanes, l-Bromoalkanes, and l-Iodoalkanes, C 1 to C 20 ., J. Chem. Eng. Data, 1961, 6, 2, 268-270, https://doi.org/10.1021/je60010a025 . [all data]

Dykyj and Vanko, 1970
Dykyj, J.; Vanko, A., Petrochemica, 1970, 10, 1, 3. [all data]