12-Hydroxydodecanoic acid

Condensed phase thermochemistry data

Data compiled by: Hussein Y. Afeefy, Joel F. Liebman, and Stephen E. Stein

Quantity Value Units Method Reference Comment
Δfsolid-959. ± 3.kJ/molCmWiberg and Waldron, 1991

Reaction thermochemistry data

Data compiled by: Hussein Y. Afeefy, Joel F. Liebman, and Stephen E. Stein

Individual Reactions

12-Hydroxydodecanoic acid = Water + Oxacyclotridecan-2-one

By formula: C12H24O3 = H2O + C12H22O2

Quantity Value Units Method Reference Comment
Δr9. ± 4.kJ/molCmWiberg and Waldron, 1991solid phase

Phase change data

Data compiled by: Thermodynamics Research Center, NIST Boulder Laboratories, Chris Muzny director

Quantity Value Units Method Reference Comment
Tfus357.KN/ALycan and Adams, 1929Uncertainty assigned by TRC = 4. K

In addition to the Thermodynamics Research Center (TRC) data available from this site, much more physical and chemical property data is available from the following TRC products:

References

Wiberg and Waldron, 1991
Wiberg, K.B.; Waldron, R.F., Lactones. 2. Enthalpies of hydrolysis, reduction, and formation of the C4-C13 monocyclic lactones. strain energies and conformations, J. Am. Chem. Soc., 1991, 113, 7697-7705. [all data]