Cis-Cyclopenten-1,2-diol

Condensed phase thermochemistry data

Data compiled by: Hussein Y. Afeefy, Joel F. Liebman, and Stephen E. Stein

Quantity Value Units Method Reference Comment
Δcsolid-2911.6 ± 4.2kJ/molCcbJung and Dahmlos, 1942Reanalyzed by Cox and Pilcher, 1970, Original value = -2908. kJ/mol; Corresponding Δfsolid = -485.05 kJ/mol (simple calculation by NIST; no Washburn corrections)
Δcsolid-2912.kJ/molCcbRoth and Muller, 1929Corresponding Δfsolid = -484.5 kJ/mol (simple calculation by NIST; no Washburn corrections)
Δcsolid-2909. ± 0.54kJ/molCcbVerkade, Coops, et al., 1928At 288 °K; Corresponding Δfsolid = -487.9 kJ/mol (simple calculation by NIST; no Washburn corrections)

Lee's RI, non-polar column, custom temperature program

View large format table.

Column type Active phase I Reference Comment
CapillaryDB-5160.Fuentes, Font, et al., 2007Column length: 60. m; Program: not specified

Phase change data

Data compiled by: Robert L. Brown and Stephen E. Stein

Reduced pressure boiling point

Tboil (K) Pressure (atm) Reference
381.70.026Aldrich Chemical Company Inc., 1990
397.20.038Weast and Grasselli, 1989

References

Jung and Dahmlos, 1942
Jung, G.; Dahmlos, J., Thermochemische untersuchungen zur frage der drehbarkeit um C-C-bindunge, Z. Phys. Chem., 1942, 190, 230-240. [all data]

Cox and Pilcher, 1970
Cox, J.D.; Pilcher, G., Thermochemistry of Organic and Organometallic Compounds, Academic Press, New York, 1970, 1-636. [all data]

Roth and Muller, 1929
Roth, W.A.; Muller, Fr., Die Zersetzungswarme der Stickstoffwasserstoffsaure, Ber., 1929, 62, 1188-1194. [all data]

Verkade, Coops, et al., 1928
Verkade, P.E.; Coops, J., Jr.; Maan, Chr.J., Calorimetrische Untersuchungen. XV. Thermochemische studien uber cycloparaffine und ihre derivate: 1. Experimentelle daten fur funf- und sechsgliedrige cyclische diole, Ann., 1928, 467, 217-239. [all data]