Methyl (Z)-dec-2-en-4,6-diynoate

Van Den Dool and Kratz RI, polar column, temperature ramp

Data compiled by: NIST Mass Spectrometry Data Center, William E. Wallace, director

Column type Capillary
Active phase BP-20
Column length (m) 50.
Carrier gas He
Substrate
Column diameter (mm) 0.22
Phase thickness (μm) 0.25
Tstart (C) 60.
Tend (C) 220.
Heat rate (K/min) 2.
Initial hold (min)
Final hold (min) 20.
I 2250.
ReferenceBoti, Koukoua, et al., 2007
Comment MSDC-RI

Kovats' RI, non-polar column, custom temperature program

Data compiled by: NIST Mass Spectrometry Data Center, William E. Wallace, director

Column type Capillary
Active phase Methyl Silicone
Column length (m) 25.
Carrier gas
Substrate
Column diameter (mm)
Phase thickness (μm)
Program 50 0C 4 0C/min -> 180 0C 10 0C/min -> 250 0C
I 1504.
ReferenceMachado, Militao, et al., 1995
Comment MSDC-RI

Van Den Dool and Kratz RI, non-polar column, temperature ramp

Data compiled by: NIST Mass Spectrometry Data Center, William E. Wallace, director

Column type CapillaryCapillaryCapillary
Active phase BP-1HP-5MSHP-5MS
Column length (m) 50.30.30.
Carrier gas HeHeHe
Substrate
Column diameter (mm) 0.220.250.25
Phase thickness (μm) 0.250.250.25
Tstart (C) 60.60.60.
Tend (C) 220.280.280.
Heat rate (K/min) 2.3.3.
Initial hold (min)
Final hold (min) 20.
I 1471.1512.1491.
ReferenceBoti, Koukoua, et al., 2007Tzakou, Vagias, et al., 2004Tzakou, Vagias, et al., 2004
Comment MSDC-RI MSDC-RI MSDC-RI

References

Boti, Koukoua, et al., 2007
Boti, J.B.; Koukoua, G.; N'Guessan, T.Y.; Casanova, J., Chemical variability of Conyza sumatrensis and Microglossa pyrifolia from Côte d'Ivoire, Flavour Fragr. J., 2007, 22, 1, 27-31, https://doi.org/10.1002/ffj.1743 . [all data]