Neophytadiene

Van Den Dool and Kratz RI, non-polar column, temperature ramp

Data compiled by: NIST Mass Spectrometry Data Center, William E. Wallace, director

Column type CapillaryCapillaryCapillaryCapillaryCapillary
Active phase HP-5MSDB-5MSHP-5MSHP-5OV-1
Column length (m) 30.60.30.30.25.
Carrier gas HeHeHe H2
Substrate
Column diameter (mm) 0.250.250.250.250.25
Phase thickness (μm) 0.250.250.250.250.3
Tstart (C) 60.40.60.60.50.
Tend (C) 280.200.280.280.200.
Heat rate (K/min) 3.2.3.3.3.
Initial hold (min)    5.1.
Final hold (min)  20.  20.
I 1840.1836.1806.1837.1827.
ReferenceKukic J., Petrovic S., et al., 2006Seo and Baek, 2005Tzakou, Vagias, et al., 2004Fokialakis, Magiatis, et al., 2002Bicchi, Fresia, et al., 1997
Comment MSDC-RI MSDC-RI MSDC-RI MSDC-RI MSDC-RI
Column type Capillary
Active phase DB-1
Column length (m) 30.
Carrier gas N2
Substrate
Column diameter (mm) 0.32
Phase thickness (μm) 0.25
Tstart (C) 150.
Tend (C) 280.
Heat rate (K/min) 3.
Initial hold (min)
Final hold (min)
I 1842.
ReferenceCoen, Engel, et al., 1995
Comment MSDC-RI

Normal alkane RI, polar column, temperature ramp

Data compiled by: NIST Mass Spectrometry Data Center, William E. Wallace, director

Column type CapillaryCapillaryCapillaryCapillaryCapillary
Active phase HP-20MInnowaxEC-1000TC-WaxSupelcowax-10
Column length (m) 50.50.30.60.60.
Carrier gas HeHeHeHeHe
Substrate
Column diameter (mm) 0.20.20.250.250.32
Phase thickness (μm) 0.20.50.25
Tstart (C) 70.60.35.80.60.
Tend (C) 180.250.230.250.220.
Heat rate (K/min) 4.2.5.4.2.
Initial hold (min) 4. 5. 1.
Final hold (min) 15.60.15.47.
I 1912.1910.1915.1961.1931.
ReferenceMastelic, Jerkovic, et al., 2006Bendimerad and Bendiab, 2005Bendall, 2001Miyazawa, Kurose, et al., 2001Loughrin, Hamilton-Kemp, et al., 1990
Comment MSDC-RI MSDC-RI MSDC-RI MSDC-RI MSDC-RI
Column type Capillary
Active phase Supelcowax-10
Column length (m) 60.
Carrier gas He
Substrate
Column diameter (mm) 0.32
Phase thickness (μm)
Tstart (C) 60.
Tend (C) 220.
Heat rate (K/min) 2.
Initial hold (min) 1.
Final hold (min) 30.
I 1931.
ReferenceAndersen, Hamilton-Kemp, et al., 1988
Comment MSDC-RI

References

Kukic J., Petrovic S., et al., 2006
Kukic J.; Petrovic S.; Pavlovic M.; Couladis M.; Tzakou O.; Niketic M., Composition of essential oil of Stachys alpina L. ssp dinarica Murb., Flavour Fragr. J., 2006, 21, 3, 539-542, https://doi.org/10.1002/ffj.1684 . [all data]

Seo and Baek, 2005
Seo, W.H.; Baek, H.H., Identification of characteristic aroma-active compounds from water dropword (Oenanthe javanica DC.), J. Agric. Food Chem., 2005, 53, 17, 6766-6770, https://doi.org/10.1021/jf050150z . [all data]

Tzakou, Vagias, et al., 2004
Tzakou, O.; Vagias, C.; Gani, A.; Yannitsaros, A., Volatile constituents of essential oils isolated at different growth stages from three Conyza species growing in Greece, Flavour Fragr. J., 2004, 19, 425-428. [all data]

Fokialakis, Magiatis, et al., 2002
Fokialakis, N.; Magiatis, P.; Mitaku, S., Essential oil constituents of Valeriana italica and Valeriana tuberosa. Stereochemical and conformational study of 15-acetoxyvaleranone, Z. Naturforsch., 2002, 57c, 791-796. [all data]

Bicchi, Fresia, et al., 1997
Bicchi, C.; Fresia, M.; Rubiolo, P.; Monti, D.; Franz, C.; Goehler, I., Constituents of Tagetes lucida Cav. ssp. lucida essential oil, Flavour Fragr. J., 1997, 12, 1, 47-52, https://doi.org/10.1002/(SICI)1099-1026(199701)12:1<47::AID-FFJ610>3.0.CO;2-7 . [all data]

Coen, Engel, et al., 1995
Coen, M.; Engel, R.; Nahrstedt, A., Chavicol β-D-glucoside, a phenylpropanoid heteroside, benzyl-β-D-glucoside and glycosidically bound volatiles from subspecies of Cedronella canariensis, Phytochemistry, 1995, 40, 1, 149-155, https://doi.org/10.1016/0031-9422(95)00241-X . [all data]