Isoxazolidine

Gas phase ion energetics data

Data compiled by: Sharon G. Lias, Rhoda D. Levin, and Sherif A. Kafafi

Ionization energy determinations

IE (eV) Method Reference Comment
9.57PERademacher and Freckmann, 1978Vertical value

References

Rademacher and Freckmann, 1978
Rademacher, P.; Freckmann, B., Photoelectron spectra and conformations of tetrahydro-1,2-oxazines and isoxazolidines, Tetrahedron Lett., 1978, 841. [all data]