4,6-Pentamethylenesemibullvalene

Reaction thermochemistry data

Data compiled by: Hussein Y. Afeefy, Joel F. Liebman, and Stephen E. Stein

Individual Reactions

C13H16 = C13H16

By formula: C13H16 = C13H16

Quantity Value Units Method Reference Comment
Δr-1.13kcal/molEqkWingard, Russell, et al., 1974liquid phase; solvent: CDCl3

References

Wingard, Russell, et al., 1974
Wingard, R.E., Jr.; Russell, R.K.; Paquette, L.A., Equilibrium imbalances arising from 2,8-bridging by aliphatic chains of the semibullvalene nucleus, J. Am. Chem. Soc., 1974, 96, 7474-7482. [all data]