1,3-Cyclohexanedione

Condensed phase thermochemistry data

Data compiled by: Hussein Y. Afeefy, Joel F. Liebman, and Stephen E. Stein

Quantity Value Units Method Reference Comment
Δfsolid-425.4 ± 1.1kJ/molCcbPilcher, Parchment, et al., 1993
Quantity Value Units Method Reference Comment
Δcsolid-3079.0 ± 0.8kJ/molCcbPilcher, Parchment, et al., 1993Corresponding Δfsolid = -425.4 kJ/mol (simple calculation by NIST; no Washburn corrections)

Gas phase thermochemistry data

Data compiled by: Hussein Y. Afeefy, Joel F. Liebman, and Stephen E. Stein

Quantity Value Units Method Reference Comment
Δfgas-335.6 ± 1.6kJ/molCcbPilcher, Parchment, et al., 1993

References

Pilcher, Parchment, et al., 1993
Pilcher, G.; Parchment, O.G.; Hillier, I.H.; Heatley, F.; Fletcher, D.; Ribeiro da Silva, M.A.V.; Ferrao, M.L.C.C.H.; Monte, J.S.; Jiye, F., Thermochemical and theoretical studies on cyclohexanediones, J. Phys. Chem., 1993, 97, 243-247. [all data]