Phenylbutazone

Phase change data

Data compiled by: Thermodynamics Research Center, NIST Boulder Laboratories, Chris Muzny director

Quantity Value Units Method Reference Comment
Tfus377.KN/AGrady, Hays, et al., 1973Uncertainty assigned by TRC = 1. K

In addition to the Thermodynamics Research Center (TRC) data available from this site, much more physical and chemical property data is available from the following TRC products:

Kovats' RI, non-polar column, isothermal

View large format table.

Column type Active phase Temperature (C) I Reference Comment
CapillaryBP-1275.2404.Japp, Gill, et al., 198725. m/0.22 mm/0.25 μm, N2

Kovats' RI, non-polar column, temperature ramp

View large format table.

Column type Active phase I Reference Comment
CapillarySE-302368.Schepers, Wijsbeek, et al., 198225. m/0.49 mm/1.14 μm, 100. C @ 2. min, 8. K/min, 275. C @ 15. min

Kovats' RI, non-polar column, custom temperature program

View large format table.

Column type Active phase I Reference Comment
PackedOV-1012350.McLinden and Stenhouse, 1979N2, Chromosorb W; Column length: 2. m; Program: not specified

Van Den Dool and Kratz RI, non-polar column, temperature ramp

View large format table.

Column type Active phase I Reference Comment
CapillaryVF-5MS2443.6Tretyakov, 201430. m/0.25 mm/0.25 μm, He; Tstart: 60. C; Tend: 270. C
CapillaryDB-12344.Perrigo, Peel, et al., 198515. m/0.32 mm/0.25 μm, He, 8. K/min, 280. C @ 5. min; Tstart: 120. C
CapillaryDB-12344.Perrigo, Ballantyne, et al., 198415. m/0.25 mm/0.25 μm, He, 8. K/min, 280. C @ 5. min; Tstart: 120. C
CapillaryDB-12352.Perrigo, Ballantyne, et al., 198415. m/0.25 mm/0.25 μm, He, 12. K/min, 280. C @ 5. min; Tstart: 120. C
CapillaryDB-12358.Perrigo, Ballantyne, et al., 198415. m/0.25 mm/0.25 μm, He, 15. K/min, 280. C @ 5. min; Tstart: 120. C
CapillaryDB-12333.Perrigo, Ballantyne, et al., 198415. m/0.25 mm/0.25 μm, He, 5. K/min, 280. C @ 5. min; Tstart: 120. C
PackedSE-302370.Perrigo and Peel, 1981N2, Chromosorb W, 130. C @ 2. min, 8. K/min, 290. C @ 8. min; Column length: 1.8 m

Van Den Dool and Kratz RI, non-polar column, custom temperature program

View large format table.

Column type Active phase I Reference Comment
CapillaryBP-12345.Stowell and Wilson, 198712. m/0.22 mm/0.25 μm, He; Program: 120C => 8C/min => 270C => 25C/min => 300C

Normal alkane RI, non-polar column, temperature ramp

View large format table.

Column type Active phase I Reference Comment
CapillaryDB-12394.Anderson and Fuller, 198710. m/0.53 mm/2.65 μm, He, 5. K/min; Tstart: 130. C; Tend: 230. C
CapillaryDB-12358.Sharp, 198715. m/0.25 mm/0.25 μm, He, 130. C @ 1. min, 10. K/min, 290. C @ 10. min
CapillaryBP-12344.Stowell and Wilson, 198512. m/0.22 mm/0.25 μm, He, 8. K/min; Tstart: 120. C; Tend: 280. C
PackedSE-302365.Marozzi, Gambaro, et al., 1982Gas Chrom P, 5. K/min; Column length: 2. m; Tstart: 150. C; Tend: 300. C
PackedSE-302370.Peel and Perrigo, 1976Nitrogen, Chromosorb W AW DMS (80-100 mesh), 130. C @ 2. min, 8. K/min, 290. C @ 8. min; Column length: 2. m
PackedSE-302370.Peel and Perrigo, 1975N2, Chromosorb W AW DMS, 130. C @ 2. min, 8. K/min, 290. C @ 8. min; Column length: 2. m

Normal alkane RI, non-polar column, custom temperature program

View large format table.

Column type Active phase I Reference Comment
CapillaryHP-12375.Grigor'ev, Bozhko, et al., 2009Helium; Program: not specified
CapillaryPolydimethyl siloxanes2365.Schutz and Wollrab A., 1988Program: not specified
CapillaryBP-12345.Stowell and Wilson, 198512. m/0.22 mm/0.25 μm, He; Program: 120 0X 8 0C/min -> 270 0C 25 0C/min -> 300 0C (5 min)
CapillaryBP-12370.Stowell and Wilson, 198512. m/0.22 mm/0.25 μm, He; Program: not specified
OtherMethyl Silicone2365.Ardrey and Moffat, 1981Program: not specified

References

Grady, Hays, et al., 1973
Grady, L.T.; Hays, S.E.; King, R.H.; Klein, H.R.; Mader, W.J.; Wyatt, D.K.; Zimmere, R.O., Drug purity profiles, J. Pharm. Sci., 1973, 62, 459. [all data]

Japp, Gill, et al., 1987
Japp, M.; Gill, R.; Osselton, M.D., Comparison of drug retention indices determined on packed, wide bore capillary and narrow bore capillary columns, J. Forensic Sci., 1987, 32, 6, 1574-1586. [all data]

Schepers, Wijsbeek, et al., 1982
Schepers, P.; Wijsbeek, J.; Franke, J.P.; de Zeeuw, R.A., Applicability of capillary gas chromatography to substance identification in toxicology by means of retention indices, J. Forensic Sci., 1982, 27, 1, 49-60. [all data]

McLinden and Stenhouse, 1979
McLinden, V.J.; Stenhouse, A.M., A chromatography system for drug identification, Forensic Sci. Int., 1979, 13, 71-79, https://doi.org/10.1016/0379-0738(79)90265-2 . [all data]

Tretyakov, 2014
Tretyakov, K.V., Retention Data. NIST Mass Spectrometry Data Center., NIST Mass Spectrometry Data Center, 2014. [all data]

Perrigo, Peel, et al., 1985
Perrigo, B.J.; Peel, H.W.; Ballantyne, D.J., Use of Dual-Column Fused-Silica Capillary Gas Chromatography in Combination with Detector Response Factors for Analytical Toxicology., J. Chromatogr., 1985, 341, 81-88, https://doi.org/10.1016/S0378-4347(00)84011-6 . [all data]

Perrigo, Ballantyne, et al., 1984
Perrigo, B.J.; Ballantyne, D.J.; Peel, H.W., Condierations in developing a data base for drugs on a DBI capillary column, J. Can. Soc. Forensic Sci., 1984, 17, 2, 41-49, https://doi.org/10.1080/00085030.1984.10757360 . [all data]

Perrigo and Peel, 1981
Perrigo, B.J.; Peel, H.W., The use of retention indices and temperature-programmed gas chromatography in analytical toxicology, J. Chromatogr. Sci., 1981, 19, 5, 219-226, https://doi.org/10.1093/chromsci/19.5.219 . [all data]

Stowell and Wilson, 1987
Stowell, A.; Wilson, L.W., A simple approach to the interlaboratory transfer of drug retention indices determined by temperature programmed capillary gas chromatography, J. Forensic Sci., 1987, 32, 5, 1214-1220. [all data]

Anderson and Fuller, 1987
Anderson, W.H.; Fuller, D.C., A simplified procedure for the isolation, characterization, and identification of weak acid and neutral drugs from whole blood, J. Anal. Toxicol., 1987, 11, 5, 198-204, https://doi.org/10.1093/jat/11.5.198 . [all data]

Sharp, 1987
Sharp, M.E., A rapid screening procedure for acidic and neutral drugs in blood by high resolution gas chromatography, J. Anal. Toxicol., 1987, 11, 1, 8-11, https://doi.org/10.1093/jat/11.1.8 . [all data]

Stowell and Wilson, 1985
Stowell, A.; Wilson, L., Use of retention indices in drug screening by capillary gas chromatography, Rep. # CD 2362, Department of Scientific and Industrial Reseach, Chemistry Division, Lower Hutt, NZ, 1985, 32. [all data]

Marozzi, Gambaro, et al., 1982
Marozzi, E.; Gambaro, V.; Saligari, E.; Mariani, R.; Lodi, F., Use of the retention index in gas chromatographic studies of drugs, J. Anal. Toxicol., 1982, 6, 4, 185-192, https://doi.org/10.1093/jat/6.4.185 . [all data]

Peel and Perrigo, 1976
Peel, H.W.; Perrigo, B., A practical gas chromatographic screening procedure for toxicological analysis, Can. Soc. Forens. Sci. J., 1976, 9, 2, 69-74, https://doi.org/10.1080/00085030.1976.10757247 . [all data]

Peel and Perrigo, 1975
Peel, H.W.; Perrigo, B., A practical gas chromatographic screening procedure for toxicological analysis, Can.Soc.Forens.Sci.J., 1975, 9, 2, 69-74, https://doi.org/10.1080/00085030.1976.10757247 . [all data]

Grigor'ev, Bozhko, et al., 2009
Grigor'ev, A.M.; Bozhko, E.S.; Rudakova, L.V., Use of correlation between retention indices on low-polarity phases for screening comp-lex mixtures by gas chromatography-mass spectrometry, Rus. J. Anal. Chem., 2009, 64, 2, 140-143, https://doi.org/10.1134/S1061934809020087 . [all data]

Schutz and Wollrab A., 1988
Schutz, H.; Wollrab A., The significance of the retention index in toxicologic analysis II, Pharmazie in unzerer Zeit, 1988, 17, 4, 97-101. [all data]

Ardrey and Moffat, 1981
Ardrey, R.E.; Moffat, A.C., Gas-liquid chromatographic retention indices of 1318 substances of toxicological interest on SE-30 or OV-1 stationary phase, J. Chromatogr., 1981, 220, 3, 195-252, https://doi.org/10.1016/S0021-9673(00)81925-1 . [all data]