5-Hepten-2-amine, N,6-dimethyl-

Kovats' RI, non-polar column, isothermal

View large format table.

Column type Active phase Temperature (C) I Reference Comment
PackedOV-101100.1033.Huber, Kenndler, et al., 1979N2; Column length: 2. m
PackedApiezon L100.1016.Huber, Kenndler, et al., 1979
PackedApiezon L100.1016.Donike and Stratmann, 1976Chromosorb W

Van Den Dool and Kratz RI, non-polar column, temperature ramp

View large format table.

Column type Active phase I Reference Comment
CapillaryRTX-51054.1Ádámová, Orinák, et al., 200530. m/0.25 mm/0.25 μm, N2, 40. C @ 2. min, 5. K/min, 300. C @ 10. min
CapillaryRTX-51055.7Ádámová, Orinák, et al., 200530. m/0.25 mm/0.25 μm, N2, 40. C @ 2. min, 5. K/min, 300. C @ 10. min

Normal alkane RI, non-polar column, isothermal

View large format table.

Column type Active phase Temperature (C) I Reference Comment
CapillaryApieson L / KOH150.1015.Caddy, Fish, et al., 1973
CapillaryApieson L / KOH150.1023.Caddy, Fish, et al., 1973
CapillaryApieson L / KOH150.1029.Caddy, Fish, et al., 1973

Normal alkane RI, non-polar column, custom temperature program

View large format table.

Column type Active phase I Reference Comment
CapillaryRTX-51052.Ádámová, Orinák, et al., 200530. m/0.25 mm/0.25 μm, N2; Program: not specified
CapillaryRTX-51052.Ádámová, Orinák, et al., 200530. m/0.25 mm/0.25 μm, N2; Program: not specified
OtherMethyl Silicone1052.Ardrey and Moffat, 1981Program: not specified

Normal alkane RI, polar column, isothermal

View large format table.

Column type Active phase Temperature (C) I Reference Comment
CapillaryCarbowax 20M / KOH150.1280.Caddy, Fish, et al., 1973
CapillaryCarbowax 20M / KOH150.1289.Caddy, Fish, et al., 1973
CapillaryCarbowax 20M / KOH150.1292.Caddy, Fish, et al., 1973

References

Huber, Kenndler, et al., 1979
Huber, J.F.K.; Kenndler, E.; Reich, G., Quantitation of the Information Content of Multi-Dimensional Gas Chromatography and Low- Resolution Mass Spectrometry in the Identification of Doping Drugs, J. Chromatogr., 1979, 172, 1, 15-30, https://doi.org/10.1016/S0021-9673(00)90941-5 . [all data]

Donike and Stratmann, 1976
Donike, M.; Stratmann, D., Gas-chromatographische identifizierung von stimulantien der phenyläthylaminreihe mit hilfe der retnetions-indices, Z. Anal. Chem., 1976, 279, 2, 129-131, https://doi.org/10.1007/BF00440798 . [all data]

Ádámová, Orinák, et al., 2005
Ádámová, M.; Orinák, A.; Halás, L., Retention indices as identification tool in pyrolysis-capillary gas chromatography, J. Chromatogr. A, 2005, 1087, 1-2, 131-141, https://doi.org/10.1016/j.chroma.2005.01.003 . [all data]

Caddy, Fish, et al., 1973
Caddy, B.; Fish, F.; Scott, D., Chromatographic screening for drugs of abuse using capillary columds. II. Peak identification on support coated open tubular columns for a series of central nervous system stimulating drugs, Chromatographia, 1973, 6, 7, 293-300, https://doi.org/10.1007/BF02269329 . [all data]

Ardrey and Moffat, 1981
Ardrey, R.E.; Moffat, A.C., Gas-liquid chromatographic retention indices of 1318 substances of toxicological interest on SE-30 or OV-1 stationary phase, J. Chromatogr., 1981, 220, 3, 195-252, https://doi.org/10.1016/S0021-9673(00)81925-1 . [all data]