4-Isopropyl-6-methyl-1-methylene-1,2,3,4-tetrahydronaphthalene

Kovats' RI, non-polar column, temperature ramp

Data compiled by: NIST Mass Spectrometry Data Center, William E. Wallace, director

Column type CapillaryCapillaryCapillaryCapillaryCapillary
Active phase DB-5DB-5DB-5PTE-5SE-30
Column length (m) 30.30.30.60.25.
Carrier gas HeHeHeH2He
Substrate
Column diameter (mm) 0.260.250.250.320.22
Phase thickness (μm) 0.250.250.250.390.25
Tstart (C) 60.60.60.60.70.
Tend (C) 246. 240.285.220.
Heat rate (K/min) 3.3.3.4.35.
Initial hold (min)
Final hold (min)   30.
I 1566.1564.1543.1565.1526.
ReferenceAdams, Morris, et al., 2005Lucero, Estell, et al., 2003Marongiu, Piras, et al., 2003Gudzic, Dordevic, et al., 2001Kardali, Velasco-Negueruela, et al., 2000
Comment MSDC-RI MSDC-RI MSDC-RI MSDC-RI MSDC-RI
Column type CapillaryCapillary
Active phase DB-5HP-5MS
Column length (m) 30.30.
Carrier gas  He
Substrate
Column diameter (mm) 0.320.32
Phase thickness (μm)  0.25
Tstart (C) 50.70.
Tend (C) 250.250.
Heat rate (K/min) 3.3.
Initial hold (min) 5.5.
Final hold (min)
I 1570.1555.
ReferenceTzakou, Harvala, et al., 2000Siani, Ramos, et al., 1999
Comment MSDC-RI MSDC-RI

Kovats' RI, non-polar column, custom temperature program

Data compiled by: NIST Mass Spectrometry Data Center, William E. Wallace, director

Column type Capillary
Active phase HP-5
Column length (m)
Carrier gas He
Substrate
Column diameter (mm)
Phase thickness (μm)
Program 60C(5min) => 3C/min => 100C => 1C/min => 160C => 10C/min => 240C(10min)
I 1546.
Referencede Marchese, de Heluani, et al., 2007
Comment MSDC-RI

Normal alkane RI, non-polar column, temperature ramp

Data compiled by: NIST Mass Spectrometry Data Center, William E. Wallace, director

Column type CapillaryCapillaryCapillaryCapillaryCapillary
Active phase HP-5HP-5RTX-1RTX-1HP-5
Column length (m) 30.30.60.60.30.
Carrier gas NitrogenHydrogenHeliumHeliumHelium
Substrate
Column diameter (mm) 0.250.250.220.220.25
Phase thickness (μm) 0.250.250.250.250.25
Tstart (C) 50.70.60.60.50.
Tend (C) 280.290.230.230.280.
Heat rate (K/min) 5.5.2.2.9.
Initial hold (min) 1.   3.
Final hold (min) 1. 30.30.3.
I 1548.1571.1548.1566.1560.
ReferenceTekaya-Karoui, Boughalleb, et al., 2011Radulovic, Dordevic, et al., 2010Museli, Pau, et al., 2009Museli, Pau, et al., 2009Aicha, Ines, et al., 2008
Comment MSDC-RI MSDC-RI MSDC-RI MSDC-RI MSDC-RI
Column type CapillaryCapillaryCapillaryCapillaryCapillary
Active phase RTX-1DB-5DB-5HP-1DB-5
Column length (m) 60.30.30.30.30.
Carrier gas HeHeHeliumHeHelium
Substrate
Column diameter (mm) 0.220.260.260.250.26
Phase thickness (μm) 0.250.250.250.250.25
Tstart (C) 60.60.60.60.60.
Tend (C) 230.240.290.240.290.
Heat rate (K/min) 2.3.3.2.3.
Initial hold (min)
Final hold (min) 35.  20.
I 1548.1563.1563.1527.1563.
ReferencePaolini, Tomi, et al., 2008Bos, Woerdenbag, et al., 2007Elfami, Bos, et al., 2007Hachicha, Skanji, et al., 2007Elfami, Komar, et al., 2006
Comment MSDC-RI MSDC-RI MSDC-RI MSDC-RI MSDC-RI
Column type CapillaryCapillaryCapillaryCapillaryCapillary
Active phase HP-5BP-1DB-5DB-1DB-5
Column length (m) 30.50.30.50.30.
Carrier gas HeHeHydrogenN2He
Substrate
Column diameter (mm) 0.250.220.250.250.25
Phase thickness (μm) 0.250.250.250.250.25
Tstart (C) 50.60.70.90.60.
Tend (C) 300.220.280.240.240.
Heat rate (K/min) 5.2.4.4.3.
Initial hold (min) 5. 4.
Final hold (min) 5.20.
I 1562.1549.1564.1548.1565.
ReferenceFiguérédo, Cabassu, et al., 2006Lesueur, Ban, et al., 2006Pino, Marbot, et al., 2006Velasco-Negueruela, Pérez-Alonso, et al., 2006Chaverri and Cicció, 2005
Comment MSDC-RI MSDC-RI MSDC-RI MSDC-RI MSDC-RI
Column type CapillaryCapillaryCapillaryCapillaryCapillary
Active phase HP-5MSDB-5MSDB-5DB-1DB-5
Column length (m) 30.30.30.50.30.
Carrier gas HeHeHeN2He
Substrate
Column diameter (mm) 0.250.250.250.250.32
Phase thickness (μm) 0.250.250.250.250.25
Tstart (C) 60.60.60.95.60.
Tend (C) 200.280.220.240.280.
Heat rate (K/min) 4.3.4.4.3.
Initial hold (min) 30.30.5.
Final hold (min)
I 1554.1532.1566.1553.1548.
ReferenceGauvin and Smadja, 2005Marongiu, Piras, et al., 2005Morteza-Semnani, Akbarzadeh, et al., 2005Pala-Paul, Perez-Alonso, et al., 2005Tzakou and Constantinidis, 2005
Comment MSDC-RI MSDC-RI MSDC-RI MSDC-RI MSDC-RI
Column type CapillaryCapillaryCapillaryCapillaryCapillary
Active phase BP-1DB-1DB-5HP-5MSHP-5MS
Column length (m) 50.30.25.30.30.
Carrier gas  N2NitrogenHeHe
Substrate
Column diameter (mm) 0.220.250.250.250.25
Phase thickness (μm) 0.250.250.250.250.25
Tstart (C) 60.50.60.60.60.
Tend (C) 220.200.240.280.280.
Heat rate (K/min) 2.5.3.3.4.
Initial hold (min)
Final hold (min) 20.
I 1548.1547.1560.1559.1563.
ReferenceBlanc, Muselli, et al., 2004Fekam Boyom, Fotio, et al., 2004JAvidnia, Mojab, et al., 2004Couladis, Özcan, et al., 2003Ghasemi, Asghari, et al., 2003
Comment MSDC-RI MSDC-RI MSDC-RI MSDC-RI MSDC-RI
Column type CapillaryCapillaryCapillaryCapillaryCapillary
Active phase DB-5HP-5DB-5HP-5HP-5
Column length (m) 30.30.30.25.25.
Carrier gas HeHeN2H2H2
Substrate
Column diameter (mm) 0.250.250.250.320.32
Phase thickness (μm) 0.250.250.250.530.53
Tstart (C) 60.60.40.40.40.
Tend (C) 280.280.230.280.280.
Heat rate (K/min) 3.3.2.4.4.
Initial hold (min)
Final hold (min) 30.
I 1548.1542.1550.1557.1566.
ReferenceMarongiu, Porcedda, et al., 2003Pitarokili, Tzakou, et al., 2003Rotman, Ahumada, et al., 2003Velickovic, Randjelovic, et al., 2003Velickovic, Randjelovic, et al., 2003
Comment MSDC-RI MSDC-RI MSDC-RI MSDC-RI MSDC-RI
Column type CapillaryCapillaryCapillaryCapillaryCapillary
Active phase 5 % Phenyl methyl siloxanePTE-5DB-5HP-1HP-5
Column length (m) 30.60.30.50.30.
Carrier gas HeH2HeN2H2
Substrate
Column diameter (mm) 0.250.320.250.250.25
Phase thickness (μm) 0.250.300.250.250.25
Tstart (C) 75.60.35.90.40.
Tend (C) 200.285.280.220.280.
Heat rate (K/min) 3.4.33.3.4.
Initial hold (min) 4. 2.
Final hold (min) 8. 15.
I 1566.1563.1574.1549.1563.
ReferenceCicció and Gómez-Laurito, 2002Gudzic, Djokovic, et al., 2002Krauze-Baranowska, Mardarowicz, et al., 2002Priestap, van Baren, et al., 2002Velickovic, Randjelovic, et al., 2002
Comment MSDC-RI MSDC-RI MSDC-RI MSDC-RI MSDC-RI
Column type CapillaryCapillaryCapillary
Active phase DB-5DB-1DB-5
Column length (m) 30.60.30.
Carrier gas HeN2He
Substrate
Column diameter (mm) 0.250.2480.32
Phase thickness (μm) 0.250.25
Tstart (C) 60.60.60.
Tend (C) 240.220.250.
Heat rate (K/min) 3.3.3.
Initial hold (min)  5.
Final hold (min)  22.
I 1541.1554.1554.
ReferenceZoghbi, Andrade, et al., 2002Bailac, Dellacasa, et al., 2001Abreu and Noronha, 1997
Comment MSDC-RI MSDC-RI MSDC-RI

Van Den Dool and Kratz RI, polar column, temperature ramp

Data compiled by: NIST Mass Spectrometry Data Center, William E. Wallace, director

Column type CapillaryCapillaryCapillaryCapillaryCapillary
Active phase RTX-WaxRTX-WaxRTX-WaxRTX-WaxAT-Wax
Column length (m) 60.60.60.60.60.
Carrier gas He HeHeHe
Substrate
Column diameter (mm) 0.220.220.220.220.32
Phase thickness (μm) 0.250.250.250.250.25
Tstart (C) 60.60.60.60.65.
Tend (C) 230.220.230.230.250.
Heat rate (K/min) 2.2.2.2.2.
Initial hold (min)     10.
Final hold (min) 35.20.35.45.60.
I 1932.1935.1932.1939.1893.
ReferencePaolini J., Costa J., et al., 2007Cozzani, Muselli, et al., 2005Paolini, Costa, et al., 2005Cavalli, Tomi, et al., 2003Pino, Marbot, et al., 2001
Comment MSDC-RI MSDC-RI MSDC-RI MSDC-RI MSDC-RI

References

Adams, Morris, et al., 2005
Adams, R.P.; Morris, J.A.; Pandey, R.N.; Schwarzbach, A.E., Cryptic speciation between Juniperus deltoides and Juniperus oxycedrus (Cupressaceae) in the Mediterranean, Biochem. Syst. Ecol., 2005, 33, 8, 771-787, https://doi.org/10.1016/j.bse.2005.01.001 . [all data]

Lucero, Estell, et al., 2003
Lucero, M.E.; Estell, R.E.; Frederickson, E.L., The essential oil composition of Psorothamnus scoparius (A. Gray) Rydb., J. Essent. Oil Res., 2003, 15, 2, 108-111, https://doi.org/10.1080/10412905.2003.9712083 . [all data]

Marongiu, Piras, et al., 2003
Marongiu, B.; Piras, A.; Pani, F.; Porcedda, S.; Ballero, M., Extraction, separation and isolation of essential oils from natural matrices by supercritical CO2, Flavour Fragr. J., 2003, 18, 6, 505-509, https://doi.org/10.1002/ffj.1258 . [all data]

Gudzic, Dordevic, et al., 2001
Gudzic, B.; Dordevic, S.; Palic, R.; Stojanovic, G., Essential oils of Hypericum olympicum L. and Hypericum perforatum L., Flavour Fragr. J., 2001, 16, 3, 201-203, https://doi.org/10.1002/ffj.978 . [all data]

Kardali, Velasco-Negueruela, et al., 2000
Kardali, M.; Velasco-Negueruela, A.; Pérez-Alonso, M., Essential Oil Constituents of Sideritis ibanyezii Pau, Botanica Complutensis, 2000, 24, 101-106. [all data]

Tzakou, Harvala, et al., 2000
Tzakou, O.; Harvala, C.; Galati, E.M.; Sanogo, R., Essential oil composition of Nepeta argolica Borey et Chaub. subsp. argolica, Flavour Fragr. J., 2000, 15, 2, 115-118, https://doi.org/10.1002/(SICI)1099-1026(200003/04)15:2<115::AID-FFJ877>3.0.CO;2-9 . [all data]

Siani, Ramos, et al., 1999
Siani, A.C.; Ramos, M.F.S.; Menezes-de-Lima, O., Jr.; Ribeiro-dos-Santos, R.; Fernadez-Ferreira, E.; Soares, R.O.A.; Rosas, E.C.; Susunaga, G.S.; Guimarães, A.C.; Zoghbi, M.G.B.; Henriques, M.G.M.O., Evaluation of anti-inflammatory-related activity of essential oils from the leaves and resin of species of Protium, J. Ethnopharmacol., 1999, 66, 1, 57-69, https://doi.org/10.1016/S0378-8741(98)00148-2 . [all data]