Cyclopentadecanone

Condensed phase thermochemistry data

Data compiled by: Hussein Y. Afeefy, Joel F. Liebman, and Stephen E. Stein

Quantity Value Units Method Reference Comment
Δcsolid-2249.6 ± 2.2kcal/molCcbRuzieka and Schlapfer, 1933Reanalyzed by Cox and Pilcher, 1970, Original value = -2248. kcal/mol; Corresponding Δfsolid = -117.58 kcal/mol (simple calculation by NIST; no Washburn corrections)

Phase change data

Data compiled as indicated in comments:
BS - Robert L. Brown and Stephen E. Stein
AC - William E. Acree, Jr., James S. Chickos
ALS - Hussein Y. Afeefy, Joel F. Liebman, and Stephen E. Stein

Reduced pressure boiling point

Tboil (K) Pressure (atm) Reference Comment
393.20.0004Weast and Grasselli, 1989BS

Enthalpy of sublimation

ΔsubH (kcal/mol) Temperature (K) Method Reference Comment
20.6 ± 0.1305.MEJIMENEZ, 1997Based on data from 296. - 315. K.; AC
18.5 ± 0.2321.VWolf and Weghofer, 1938ALS

Kovats' RI, non-polar column, isothermal

View large format table.

Column type Active phase Temperature (C) I Reference Comment
PackedOV-101220.1851.7Didaoui, Touabet, et al., 1997N2, Chromosorb G HP; Column length: 2. m
CapillarySE-30220.1845.5Didaoui, Touabet, et al., 199727. m/0.4 mm/1.13 μm, N2, Chromosorb G HP
CapillarySE-30200.1840.2Didaoui, Touabet, et al., 199727. m/0.4 mm/0.1 μm, N2, Chromosorb G HP
CapillaryApolane220.1860.9Didaoui, Touabet, et al., 199743. m/0.29 mm/0.28 μm, N2
PackedApolane220.1862.0Didaoui, Touabet, et al., 19972. m/0.29 mm/0.28 μm, N2, Chromosorb G HP

References

Ruzieka and Schlapfer, 1933
Ruzieka, L.; Schlapfer, P., Zur kenntnis des kohlenstoffringes XXII. Uber die verbrennungswarme bei hochgliedrigen ringverbindungen, Helv. Chim. Acta, 1933, 16, 162-169. [all data]

Cox and Pilcher, 1970
Cox, J.D.; Pilcher, G., Thermochemistry of Organic and Organometallic Compounds, Academic Press, New York, 1970, 1-636. [all data]

Weast and Grasselli, 1989
CRC Handbook of Data on Organic Compounds, 2nd Editon, Weast,R.C and Grasselli, J.G., ed(s)., CRC Press, Inc., Boca Raton, FL, 1989, 1. [all data]

JIMENEZ, 1997
JIMENEZ, P., Structural effects on the thermochemical properties of cycloalkanones II. Enthalpy of combustion, vapour pressures, enthalpy of sublimation, and standard molar enthalpy of formation in the gaseous phase of cyclopentadecanone, The Journal of Chemical Thermodynamics, 1997, 29, 11, 1281-1288, https://doi.org/10.1006/jcht.1997.0244 . [all data]

Wolf and Weghofer, 1938
Wolf, K.L.; Weghofer, H., Uber sublimationswarmen, Z. Phys. Chem., 1938, 39, 194-208. [all data]

Didaoui, Touabet, et al., 1997
Didaoui, L.; Touabet, A.; Meklati, B.Y., Comparison of mathematical methods for the calculation of retention indices at high temperature in gas chromatography, J. Hi. Res. Chromatogr., 1997, 20, 11, 605-610, https://doi.org/10.1002/jhrc.1240201107 . [all data]