α-Farnesene

Normal alkane RI, polar column, temperature ramp

Data compiled by: NIST Mass Spectrometry Data Center, William E. Wallace, director

Column type CapillaryCapillaryCapillaryCapillaryCapillary
Active phase DB-WaxRTX-WaxDB-WaxCP-Wax 52CBTC-Wax
Column length (m) 30.60.60.30.60.
Carrier gas HydrogenHeliumHeliumHeHe
Substrate
Column diameter (mm) 0.250.220.250.320.25
Phase thickness (μm) 0.250.250.250.250.25
Tstart (C) 30.60.50.40.60.
Tend (C) 230.230.220.220.240.
Heat rate (K/min) 8.2.3.3.2.
Initial hold (min) 5. 2.1.
Final hold (min) 10.30.70.2.
I 1743.1730.1749.1762.1747.
ReferenceKarlsson, Birgersson, et al., 2009Museli, Pau, et al., 2009Shimizu, Imayoshi, et al., 2009Hymete, Rohloff, et al., 2007Miyazawa and Tamura, 2007
Comment MSDC-RI MSDC-RI MSDC-RI MSDC-RI MSDC-RI
Column type CapillaryCapillaryCapillaryCapillaryCapillary
Active phase Supelcowax-10Supelcowax-10DB-WaxAT-WaxDB-Wax
Column length (m) 30.30.60.60.60.
Carrier gas He HeHeHe
Substrate
Column diameter (mm) 0.250.250.250.250.25
Phase thickness (μm) 0.250.250.250.250.5
Tstart (C) 50.40.60.60.50.
Tend (C) 250.250.180.200.230.
Heat rate (K/min) 2.2.3.4.3.
Initial hold (min)   8. 2.
Final hold (min)  33.80.20.20.
I 1738.1740.1778.1725.1744.
ReferenceRaal, Orav, et al., 2007Sylvestre, Pichette, et al., 2007Wei A. and Shibamoto T., 2007Borges, Rojas, et al., 2006Cai, Lin, et al., 2006
Comment MSDC-RI MSDC-RI MSDC-RI MSDC-RI MSDC-RI
Column type CapillaryCapillaryCapillaryCapillaryCapillary
Active phase BP-20Supelcowax-10CP-Wax 52CBDB-WaxInnowax
Column length (m) 50.30.30.60.60.
Carrier gas He He He
Substrate
Column diameter (mm) 0.220.250.320.250.25
Phase thickness (μm) 0.250.250.250.250.25
Tstart (C) 60.40.60.70.60.
Tend (C) 220.210.220.230.240.
Heat rate (K/min) 2.2.3.32.5.
Initial hold (min)  2.7.2.
Final hold (min) 20.33.3.20.30.
I 1744.1759.1738.1745.1754.
ReferenceFanciullino, Tomi, et al., 2006Garneau F.X., Collin G., et al., 2006Hymete, Rohloff, et al., 2006Lan Phi N.T., Nishiyama C., et al., 2006Joichi, Yomogida, et al., 2005
Comment MSDC-RI MSDC-RI MSDC-RI MSDC-RI MSDC-RI
Column type CapillaryCapillaryCapillaryCapillaryCapillary
Active phase DB-WaxDB-WaxDB-WaxSupelcowax-10DB-Wax
Column length (m) 60.60.60.30.60.
Carrier gas N2N2NitrogenHeHe
Substrate
Column diameter (mm) 0.250.250.320.250.25
Phase thickness (μm) 0.250.250.500.25
Tstart (C) 70.70.35.50.60.
Tend (C) 230.230.235.220.220.
Heat rate (K/min) 2.2.2.4.2.
Initial hold (min) 2.2.4.3.4.
Final hold (min) 20.20.30.30.
I 1764.1764.1766.1746.1730.
ReferenceNjoroge, Koaze, et al., 2005Njoroge, Koaze, et al., 2005, 2Qian and Wang, 2005Wong and Tan, 2005Jiang and Kubota, 2004
Comment MSDC-RI MSDC-RI MSDC-RI MSDC-RI MSDC-RI
Column type CapillaryCapillaryCapillaryCapillaryCapillary
Active phase Supelcowax-10DB-WaxSW-10HP-WaxTC-Wax
Column length (m) 50.60.50.30.60.
Carrier gas HeHeHeN2He
Substrate
Column diameter (mm) 0.20.320.200.250.25
Phase thickness (μm) 0.250.250.250.25
Tstart (C) 70.35.50.60.80.
Tend (C) 230.220.230.220.240.
Heat rate (K/min) 2.3.2.5.3.
Initial hold (min)    10.
Final hold (min)
I 1745.1750.1722.1735.1745.
ReferenceOrav, Stulova, et al., 2004Palá-Paúl, Brophy, et al., 2004Raal, Paaver, et al., 2004Bertoli, Menichini, et al., 2003Miyazawa, Teranishi, et al., 2003
Comment MSDC-RI MSDC-RI MSDC-RI MSDC-RI MSDC-RI
Column type CapillaryCapillaryCapillaryCapillaryCapillary
Active phase DB-WaxSW-10HP-InnowaxInnowaxDB-Wax
Column length (m) 60.50.50.60.60.
Carrier gas HeliumHe HeN2
Substrate
Column diameter (mm) 0.250.200.20.250.25
Phase thickness (μm)  0.250.2 0.25
Tstart (C) 70.50.50.60.70.
Tend (C) 210.250.220.220.230.
Heat rate (K/min) 2.2.4.4.2.
Initial hold (min)   5.10.2.
Final hold (min) 60.  10.20.
I 1750.1740.1740.1758.1732.
ReferenceMookdasanit, Tamura, et al., 2003Raal, Arak, et al., 2003Stashenko, Jaramillo, et al., 2003Suleimenov, Atazharova, et al., 2003Tu, Onishi, et al., 2003
Comment MSDC-RI MSDC-RI MSDC-RI MSDC-RI MSDC-RI
Column type CapillaryCapillaryCapillaryCapillaryCapillary
Active phase Supelcowax-10Supelcowax-10Supelcowax-10DB-WaxDB-Wax
Column length (m) 30.30.30.60.60.
Carrier gas HeHeHeH2H2
Substrate
Column diameter (mm) 0.250.250.250.320.32
Phase thickness (μm) 0.250.250.250.250.25
Tstart (C) 40.40.40.40.40.
Tend (C) 200.200.200.245.245.
Heat rate (K/min) 3.3.3.1.51.5
Initial hold (min) 10.10.10.
Final hold (min)    20.20.
I 1750.1747.1745.1741.1737.
ReferenceVichi, Castellote, et al., 2003Vichi, Pizzale, et al., 2003Vichi, Pizzale, et al., 2003, 2Gancel, Ollé, et al., 2002Gancel, Ollé, et al., 2002
Comment MSDC-RI MSDC-RI MSDC-RI MSDC-RI MSDC-RI
Column type CapillaryCapillaryCapillaryCapillaryCapillary
Active phase DB-WaxDB-WaxDB-WaxStabilwaxPEG-20M
Column length (m) 60.60.60.30.50.
Carrier gas N2N2HeH2He
Substrate
Column diameter (mm) 0.250.250.250.320.2
Phase thickness (μm) 0.250.250.250.25
Tstart (C) 70.70.45.60.70.
Tend (C) 230.230.240.280.250.
Heat rate (K/min) 2.2.3.10.2.
Initial hold (min)    5.
Final hold (min)    5.
I 1732.1751.1750.1733.1742.
ReferenceTu, Thanh, et al., 2002Tu, Thanh, et al., 2002Christoph, 2001Jirovetz L., Buchbauer G., et al., 2001Orav, Kailas, et al., 2001
Comment MSDC-RI MSDC-RI MSDC-RI MSDC-RI MSDC-RI
Column type CapillaryCapillaryCapillaryCapillaryCapillary
Active phase DB-WaxDB-WaxSupelcowax-10Supelcowax-10Supelcowax-10
Column length (m) 60.30.30.30.30.
Carrier gas  HeHeHeHe
Substrate
Column diameter (mm) 0.250.20.320.320.32
Phase thickness (μm) 0.25 0.250.250.25
Tstart (C) 30.50.70.70.70.
Tend (C) 170.180.240.240.240.
Heat rate (K/min) 2.3.5.5.5.
Initial hold (min) 4.8.8.8.8.
Final hold (min) 30. 20.20.20.
I 1744.1732.1698.1731.1754.
ReferenceButtery, Light, et al., 2000Franco and Shibamoto, 2000Kim, Kim, et al., 2000Kim, Kim, et al., 2000Kim, Kim, et al., 2000
Comment MSDC-RI MSDC-RI MSDC-RI MSDC-RI MSDC-RI
Column type CapillaryCapillaryCapillaryCapillaryCapillary
Active phase DB-WaxDB-WaxInnowaxHP-InnowaxHP-Innowax
Column length (m) 60.60.60.60.60.
Carrier gas HeliumHeHeHeHe
Substrate
Column diameter (mm) 0.320.250.250.250.25
Phase thickness (μm) 0.250.250.250.250.25
Tstart (C) 50.40.60.60.60.
Tend (C) 230.200.220.220.220.
Heat rate (K/min) 5.2.
Initial hold (min) 2.2.10.10.10.
Final hold (min)
I 1748.1747.1758.1758.1758.
ReferencePaniandy, Chane-Ming, et al., 2000Umano, Hagi, et al., 2000Kaya, Baser, et al., 1999Kaya, Baser, et al., 1999, 2Kaya, Baser, et al., 1999, 2
Comment MSDC-RI MSDC-RI MSDC-RI MSDC-RI MSDC-RI
Column type CapillaryCapillaryCapillaryCapillaryCapillary
Active phase Supelcowax-10HP-Innowax FSCDB-WaxPEG-20MSupelcowax-10
Column length (m) 30.60.60.60.60.
Carrier gas HeHeH2 He
Substrate
Column diameter (mm) 0.250.250.320.250.25
Phase thickness (μm)  0.250.25 0.25
Tstart (C) 60.60.60.70.40.
Tend (C) 240.220.220.220.200.
Heat rate (K/min) 4.4.3.3.3.
Initial hold (min)  10.  3.
Final hold (min)  10.  30.
I 1741.1762.1749.1754.1760.
ReferenceLamarque, Maestri, et al., 1998Tümen, Baser, et al., 1998Werkhoff, Güntert, et al., 1998Awano, Ichikawa, et al., 1997Wong and Lai, 1996
Comment MSDC-RI MSDC-RI MSDC-RI MSDC-RI MSDC-RI
Column type CapillaryCapillaryCapillaryCapillaryCapillary
Active phase Supelcowax-10Carbowax 20MDB-WaxPEG-20MCarbowax 20M
Column length (m) 90.60.60.50.45.
Carrier gas He HeHeHydrogen
Substrate
Column diameter (mm) 0.250.250.250.250.32
Phase thickness (μm) 0.25 0.250.151.0
Tstart (C) 35.60.50.60.60.
Tend (C) 220.180.180.180.200.
Heat rate (K/min) 2.2.2.52.2.
Initial hold (min) 20.4.5.4.5.
Final hold (min) 30.
I 1775.1735.1755.1714.1746.
ReferenceGirard and Lau, 1995Kawakami, Ganguly, et al., 1995Stashenko, Torres, et al., 1995Togari, Kobayashi, et al., 1995Kollmannsberger, Nitz, et al., 1992
Comment MSDC-RI MSDC-RI MSDC-RI MSDC-RI MSDC-RI
Column type CapillaryCapillaryCapillaryCapillaryCapillary
Active phase DB-WaxCarbowax 20MCarbowax 20MCarbowax 20MSupelcowax-10
Column length (m) 60.50.50.50.30.
Carrier gas  H2N2N2
Substrate
Column diameter (mm) 0.320.320.220.22
Phase thickness (μm)  0.15
Tstart (C) 50.70.80.80.50.
Tend (C) 250.210.200.200.240.
Heat rate (K/min) 4.2.3.3.4.
Initial hold (min) 0.1   2.
Final hold (min) 5.   10.
I 1742.1733.1729.1734.1753.
ReferenceBinder and Flath, 1989Gaydou, Faure, et al., 1989Mihara, Tateba, et al., 1988Mihara, Tateba, et al., 1988Ramaswami, Briscese, et al., 1988
Comment MSDC-RI MSDC-RI MSDC-RI MSDC-RI MSDC-RI
Column type CapillaryCapillaryCapillaryCapillaryCapillary
Active phase Carbowax 20MCarbowax 20MSupelcowax-10Carbowax 20MCarbowax 20M
Column length (m) 50.50.30.150.50.
Carrier gas N2N2He N2
Substrate
Column diameter (mm) 0.220.22 0.660.28
Phase thickness (μm)
Tstart (C) 80.80.50.60.80.
Tend (C) 200.200.240.170.170.
Heat rate (K/min) 3.3.4.1.1.
Initial hold (min)   2.40.
Final hold (min)   10.
I 1729.1734.1753.1735.1696.
ReferenceMihara, Tateba, et al., 1987Mihara, Tateba, et al., 1987Ramaswami, Briscese, et al., 1986Buttery, Xu, et al., 1985Yamaguchi and Shibamoto, 1980
Comment MSDC-RI MSDC-RI MSDC-RI MSDC-RI MSDC-RI

Van Den Dool and Kratz RI, non-polar column, custom temperature program

Data compiled by: NIST Mass Spectrometry Data Center, William E. Wallace, director

Column type CapillaryCapillaryCapillaryCapillaryCapillary
Active phase DB-5SE-52BPX-5VF-5MSDB-5
Column length (m) 30.30.30.30.
Carrier gas HeHeHeHe
Substrate
Column diameter (mm) 0.250.320.250.25
Phase thickness (μm) 0.250.150.250.25
Program 40C(2min) => 4C/min => 220C => 20C/min => 280C45C => 1C/min => 100C => 5C/min => 250C(10min)35C => 4C/min => 200C => 30C/min => 300C (3min)40C(2min) => 5C/min => 200C (2min) => 30C/min => 260Cnot specified
I 1509.1508.1509.1469.1511.
ReferenceAndrade, Sampaio, et al., 2007Bruni, Bianchi, et al., 2007Dharmawan, Kasapis, et al., 2007Carasek and Pawliszyn, 2006Özel, Gögüs, et al., 2006
Comment MSDC-RI MSDC-RI MSDC-RI MSDC-RI MSDC-RI
Column type CapillaryCapillaryCapillaryCapillaryCapillary
Active phase SE-52DB-5MSSE-52DB-5MSCP Sil 8 CB
Column length (m) 30.30.25.30.25.
Carrier gas HeHeH2HeHe
Substrate
Column diameter (mm) 0.320.250.320.250.32
Phase thickness (μm) 0.150.250.430.250.25
Program 45C => 1C/min => 100C => 5C/min => 250C(10min)40 (5min) => 4C/min => 140C => 4C/min => 200C (20min)60C(8min) => 3C/min => 180C => 20C/min => 250C(10min)40C(5min) => 4C/min => 160C => 8C/min => 240C (15min)35C(2min) => 5C/min => 170C => 20C/min => 240C (10min)
I 1506.1506.1508.1510.1508.
ReferenceBruni, Pellati, et al., 2005Zheng, Kim, et al., 2005Frizzo, Lorenzo, et al., 2004Kim, Lee, et al., 2003Fuhrmann and Grosch, 2002
Comment MSDC-RI MSDC-RI MSDC-RI MSDC-RI MSDC-RI
Column type CapillaryCapillaryCapillary
Active phase DB-5DB-1BPX-5
Column length (m) 30.60.50.
Carrier gas HeHeHe
Substrate
Column diameter (mm) 0.250.250.32
Phase thickness (μm) 0.250.250.5
Program 50C (1min) => 5C/min => 100C => 10C/min => 250C (9min)-20C (5min) => 10C/min => 100C => 4C/min => 200C => 10C/min => 280C0C (5min) => 40C/min => 40C (2min) => 10C/min => 280C
I 1496.1487.1518.
ReferenceBeaulieu and Grimm, 2001Eri, Khoo, et al., 2000Elmore, Erbahadir, et al., 1997
Comment MSDC-RI MSDC-RI MSDC-RI

Kovats' RI, polar column, temperature ramp

Data compiled by: NIST Mass Spectrometry Data Center, William E. Wallace, director

Column type CapillaryCapillaryCapillaryCapillaryCapillary
Active phase SupelcowaxSupelcowaxDB-WaxSupelcowax-10DB-Wax
Column length (m) 30.30.60.60.60.
Carrier gas   HeHeHe
Substrate
Column diameter (mm) 0.250.250.250.250.25
Phase thickness (μm) 0.250.25  0.25
Tstart (C) 60.60.40.35.40.
Tend (C) 240.240.200.200.200.
Heat rate (K/min) 3.3.2.3.3.
Initial hold (min) 5.5.2.5.5.
Final hold (min) 10.10. 20.
I 1740.1740.1748.1760.1754.
ReferenceRiu-Aumatell, Castellari, et al., 2004Riu-Aumatell, Castellari, et al., 2004Umano, Hagi, et al., 1994Wong and Teng, 1994Tatsuka, Suekane, et al., 1990
Comment MSDC-RI MSDC-RI MSDC-RI MSDC-RI MSDC-RI
Column type CapillaryCapillaryCapillaryCapillaryCapillary
Active phase DB-WaxDB-WaxDB-WaxCarbowax 20MCarbowax 20M
Column length (m) 60.60.60.50.50.
Carrier gas HeHeHeHeH2
Substrate
Column diameter (mm) 0.250.250.250.30.3
Phase thickness (μm) 0.250.250.25 0.15
Tstart (C) 40.40.40.70.70.
Tend (C) 200.200.200.210.210.
Heat rate (K/min) 3.3.3.2.2.
Initial hold (min) 5.5.5.
Final hold (min)
I 1755.1752.1754.1772.1734.
ReferenceTatsuka, Suekane, et al., 1990Tatsuka, Suekane, et al., 1990Tatsuka, Suekane, et al., 1990Randriamiharisoa and Gaydou, 1987Gaydou, Randriamiharisoa, et al., 1986
Comment MSDC-RI MSDC-RI MSDC-RI MSDC-RI MSDC-RI
Column type CapillaryCapillary
Active phase DB-WaxCarbowax 20M
Column length (m) 30.50.
Carrier gas N2N2
Substrate
Column diameter (mm) 0.250.28
Phase thickness (μm)
Tstart (C) 60.80.
Tend (C) 200.200.
Heat rate (K/min) 2.2.
Initial hold (min) 10.
Final hold (min)
I 1753.1695.
ReferenceUmano, Shoji, et al., 1986Yamaguchi and Shibamoto, 1979
Comment MSDC-RI MSDC-RI

Van Den Dool and Kratz RI, polar column, custom temperature program

Data compiled by: NIST Mass Spectrometry Data Center, William E. Wallace, director

Column type CapillaryCapillaryCapillaryCapillaryCapillary
Active phase CP-Wax 52CBDB-WaxDB-WaxCarbowax 20MFFAP
Column length (m) 60.30.60.25.25.
Carrier gas HeHeHeH2He
Substrate
Column diameter (mm) 0.250.250.250.320.32
Phase thickness (μm) 0.250.250.250.250.3
Program 45C(5min) => 10C/min => 80C => 2C/min => 240C40 (5min) => 4C/min => 140C => 4C/min => 200C (20min)35C(0.7min) => 20C/min => 70C => 4C/min => 240C40C(8min) => 3C/min => 180C => 20C/min => 230C35C(2min) => 5C/min => 170C => 20C/min => 240C (10min)
I 1749.1715.1737.1743.1740.
ReferenceRomeo, Ziino, et al., 2007Zheng, Kim, et al., 2005Ferrari, Lablanquie, et al., 2004Frizzo, Lorenzo, et al., 2004Fuhrmann and Grosch, 2002
Comment MSDC-RI MSDC-RI MSDC-RI MSDC-RI MSDC-RI
Column type CapillaryCapillaryCapillary
Active phase Carbowax 20MCarbowax 20MHP-Innowax
Column length (m) 30.30.30.
Carrier gas HeHeHe
Substrate
Column diameter (mm) 0.250.250.25
Phase thickness (μm) 0.250.250.25
Program 60C(3min) => 4C/min => 160C => 10C/min => 280C60C(3min) => 4C/min => 160C => 10C/min => 280C60C(8min) => 3C/min => 180C(5min) => 40C/min => 250C
I 1751.1751.1750.
ReferenceBortolomeazzi, Berno, et al., 2001Bortolomeazzi, Pizzale, et al., 2000Bisio, Ciarallo, et al., 1998
Comment MSDC-RI MSDC-RI MSDC-RI

Kovats' RI, polar column, isothermal

Data compiled by: NIST Mass Spectrometry Data Center, William E. Wallace, director

Column type CapillaryCapillaryPacked
Active phase DB-WaxCarbowax 20MCarbowax 4000
Column length (m) 30.150.3.0
Carrier gas   He
Substrate   Gas Chrom P (60-80 mesh)
Column diameter (mm) 0.250.75
Phase thickness (μm) 0.25
Temperature (C) 165.130.175.
I 1745.1756.1706.
ReferencePiskorski R., Hanus R., et al., 2007Malingré and Maarse, 1974Minyard, Tumlinson, et al., 1966
Comment MSDC-RI MSDC-RI MSDC-RI

Van Den Dool and Kratz RI, polar column, temperature ramp

Data compiled by: NIST Mass Spectrometry Data Center, William E. Wallace, director

Column type CapillaryCapillaryCapillaryCapillaryCapillary
Active phase BP-20RTX-WaxHP-20MHP-InnowaxHP-Wax
Column length (m) 50.60.50.30.30.
Carrier gas HeHeHeliumHeN2
Substrate
Column diameter (mm) 0.220.220.200.250.25
Phase thickness (μm) 0.250.250.200.50.25
Tstart (C) 60.60.70.60.60.
Tend (C) 220.230.180.260.220.
Heat rate (K/min) 2.2.4.3.5.
Initial hold (min)   4. 10.
Final hold (min) 20.35.15.
I 1747.1746.1725.1723.1727.
ReferenceBoti, Koukoua, et al., 2007Paolini, Muselli, et al., 2007Politeo, Jukic, et al., 2007Saroglou, Marin, et al., 2007Flamini, Tebano, et al., 2006
Comment MSDC-RI MSDC-RI MSDC-RI MSDC-RI MSDC-RI
Column type CapillaryCapillaryCapillaryCapillaryCapillary
Active phase BP-20DB-WaxDB-WaxDB-WaxRTX-Wax
Column length (m) 50.30.30.60.60.
Carrier gas HeHeHeN2He
Substrate
Column diameter (mm) 0.220.250.250.250.22
Phase thickness (μm) 0.250.250.250.250.25
Tstart (C) 60.40.40.70.60.
Tend (C) 220.250.250.230.230.
Heat rate (K/min) 2.3.3.2.2.
Initial hold (min)    2.
Final hold (min) 20.20.20.20.35.
I 1753.1736.1740.1764.1744.
ReferenceBoti J.B., Koukoua G., et al., 2005Fanciullino, Gancel, et al., 2005Gancel, Ollitrault, et al., 2005Njoroge, Koaze, et al., 2005Paolini, Costa, et al., 2005
Comment MSDC-RI MSDC-RI MSDC-RI MSDC-RI MSDC-RI
Column type CapillaryCapillaryCapillaryCapillaryCapillary
Active phase Supelcowax-10DB-WaxHP-WaxDB-WaxHP-Wax
Column length (m) 30.30.30.60.30.
Carrier gas HeN2N2HeN2
Substrate
Column diameter (mm) 0.250.250.250.320.25
Phase thickness (μm) 0.250.250.250.250.25
Tstart (C) 60.60.60.32.60.
Tend (C) 240.220.220.220.240.
Heat rate (K/min) 3.5.5.3.3.
Initial hold (min) 5.10.10.
Final hold (min) 10.
I 1747.1733.1736.1745.1748.
ReferenceRiu-Aumatell, Lopez-Tamames, et al., 2005Bertoli, Menichini, et al., 2004Bertoli, Pistelli, et al., 2004Brophy, Goldsack, et al., 2004Flamini, Cioni, et al., 2004
Comment MSDC-RI MSDC-RI MSDC-RI MSDC-RI MSDC-RI
Column type CapillaryCapillaryCapillaryCapillaryCapillary
Active phase HP-InnowaxZB-WaxDB-WaxHP-WaxRTX-Wax
Column length (m) 30.30.30.30.60.
Carrier gas HeHeHeN2He
Substrate
Column diameter (mm) 0.250.250.250.250.22
Phase thickness (μm) 0.50.150.250.250.25
Tstart (C) 60.35.40.60.60.
Tend (C) 260.220.200.220.230.
Heat rate (K/min) 3.1.84.5.2.
Initial hold (min)  10.5.10.
Final hold (min)  10.20. 45.
I 1742.1744.1720.1700.1742.
ReferenceGrujic-Jovanovic, Skaltsa, et al., 2004Ledauphin, Saint-Clair, et al., 2004Zheng, Kim, et al., 2004Campeol, Flamini, et al., 2003Cavalli, Tomi, et al., 2003
Comment MSDC-RI MSDC-RI MSDC-RI MSDC-RI MSDC-RI
Column type CapillaryCapillaryCapillaryCapillaryCapillary
Active phase DB-WaxCP-Wax 52CBHP-InnowaxMegawaxBP-20
Column length (m) 60.50.30.30.50.
Carrier gas H2HeHeHeHe
Substrate
Column diameter (mm) 0.320.250.250.250.22
Phase thickness (μm) 0.250.20.50.250.25
Tstart (C) 40.32.60.40.60.
Tend (C) 245.220.260.220.220.
Heat rate (K/min) 1.51.3.2.2.
Initial hold (min)  1. 6.
Final hold (min) 20.  10.20.
I 1740.1708.1723.1730.1744.
ReferenceGancel, Ollitrault, et al., 2003Kjeldsen, Christensen, et al., 2003Skaltsa, Demetzos, et al., 2003Verzera, Trozzi, et al., 2003Lota, de Rocca Serra, et al., 2002
Comment MSDC-RI MSDC-RI MSDC-RI MSDC-RI MSDC-RI
Column type CapillaryCapillaryCapillaryCapillaryCapillary
Active phase CP-Wax 52CBAT-WaxDB-WaxDB-WaxCP-Wax 52CB
Column length (m) 50.60.60.60.25.
Carrier gas  HeHeHe
Substrate
Column diameter (mm) 0.250.320.50.500.25
Phase thickness (μm) 0.20.250.321.00.15
Tstart (C) 32.65.40.60.40.
Tend (C) 220.250.290.225.220.
Heat rate (K/min) 1.2.4.3.3.
Initial hold (min) 1.10.2. 5.
Final hold (min)  60.5.
I 1713.1732.1756.1735.1752.
ReferenceKjeldsen, Christensen, et al., 2001Pino and Marbot, 2001Bartley and Jacobs, 2000Brophy, Goldsack, et al., 2000Chagonda, Makanda, et al., 2000
Comment MSDC-RI MSDC-RI MSDC-RI MSDC-RI MSDC-RI
Column type CapillaryCapillaryCapillaryCapillaryCapillary
Active phase DB-WaxDB-WaxSupelcowax-10BP-20Megawax
Column length (m) 30.30.30.50.30.
Carrier gas HeHeHeHeHe
Substrate
Column diameter (mm) 0.250.250.320.220.25
Phase thickness (μm) 0.250.250.250.250.25
Tstart (C) 40.40.75.60.40.
Tend (C) 200.200.200.230.220.
Heat rate (K/min) 2.2.2.52.2.
Initial hold (min) 5.5.  6.
Final hold (min) 20.20. 35.10.
I 1743.1749.1723.1740.1730.
ReferenceKim, Thuy, et al., 2000Kim, Thuy, et al., 2000Lazari, Skaltsa, et al., 2000Lota, de Rocca Serra, et al., 2000Verzera, Trozzi, et al., 2000
Comment MSDC-RI MSDC-RI MSDC-RI MSDC-RI MSDC-RI
Column type CapillaryCapillaryCapillaryCapillaryCapillary
Active phase CP-Wax 52CBCP-Wax 52CBHP-InnowaxInnowaxCarbowax 20M
Column length (m) 50.50.60.60.25.
Carrier gas   HeHeH2
Substrate
Column diameter (mm) 0.320.320.250.250.25
Phase thickness (μm)    0.250.3
Tstart (C) 60.60.32.50.50.
Tend (C) 220.220.220.180.200.
Heat rate (K/min) 4.4.2.2.53.
Initial hold (min) 5.5.1.5.1.
Final hold (min) 30.30.40. 20.
I 1737.1756.1756.1752.1754.
ReferenceChevance and Farmer, 1999Chevance and Farmer, 1999, 2Christensen, Jakobsen, et al., 1999Stashenko, Cervantes, et al., 1999Bicchi, Rubiolo, et al., 1998
Comment MSDC-RI MSDC-RI MSDC-RI MSDC-RI MSDC-RI
Column type CapillaryCapillaryCapillaryCapillaryCapillary
Active phase Carbowax 20MDB-WaxDB-WaxCP-Wax 52CBHP-20M
Column length (m) 25.60.60.50.50.
Carrier gas  He H2He
Substrate
Column diameter (mm) 0.250.250.250.320.25
Phase thickness (μm) 0.30.250.25
Tstart (C) 50.50.50.50.60.
Tend (C) 200.180.230.200.190.
Heat rate (K/min) 3.2.52.1.53.
Initial hold (min) 1.5. 10.
Final hold (min) 20.  40.
I 1758.1752.1725.1760.1725.
ReferenceBicchi, Fresia, et al., 1997Stashenko, Prada, et al., 1996Shimoda, Shigematsu, et al., 1995Wu and Yang, 1994Chung, Eiserich, et al., 1993
Comment MSDC-RI MSDC-RI MSDC-RI MSDC-RI MSDC-RI

Normal alkane RI, polar column, custom temperature program

Data compiled by: NIST Mass Spectrometry Data Center, William E. Wallace, director

Column type CapillaryCapillaryCapillaryCapillaryCapillary
Active phase Innowax FSCDB-WaxHP InnowaxHP-InnowaxCP-Wax 52 CB
Column length (m) 60.60.30.30.60.
Carrier gas HeliumHeliumNitrogenHeliumHelium
Substrate
Column diameter (mm) 0.250.200.250.250.25
Phase thickness (μm) 0.250.250.250.250.25
Program 60 0C (10 min) 4 0C/min -> 220 0C (10 min) 1 oC/min -> 240 0C40 0C (3 min) 2 0C/min -> 150 0C 4 0C/min -> 220 0C (20 min) 5 0C/min -> 230 0C35 0C (10 min) 3 0C/min -> 205 0C 10 0C/min -> 225 0C45 0C (1 min) 5 oC/min -> 170 0C 10 0C/min -> 260 0C (1 min)45 0C (5 min) 3 0C/min -> 150 0C 10 0C/min -> 240 0C
I 1758.1747.1755.1755.1731.
ReferenceAkin, Saracoglu, et al., 2012Gyawali and Kim, 2012Laribi, Kouki, et al., 2011Cajka, Riddellova, et al., 2010Romeo, Verzera, et al., 2009
Comment MSDC-RI MSDC-RI MSDC-RI MSDC-RI MSDC-RI
Column type CapillaryCapillaryCapillaryCapillaryCapillary
Active phase DB-WaxDB-WaxDB-WaxInnowaxHP-Innowax FSC
Column length (m) 20.20.30.30.60.
Carrier gas HeliumHeliumHeliumHeliumN2
Substrate
Column diameter (mm) 0.180.180.320.250.25
Phase thickness (μm) 0.180.180.500.250.25
Program 35 0C (1 min) 2.9 0C/min -> 100 0C 8 0C/min -> 200 0C (5 min)35 0C (1 min) 2/9 0C/min -> 100 0C 8 0C/min -> 200 0C (5 min)40 0C 7 0C/min -> 110 0C 15 0C/min -> 250 0C (3 min)not specified60C(10min) => 4C/min => 220C(10min) => 1C/min => 240C
I 1738.1738.1747.1755.1758.
ReferenceRowan, Hunt, et al., 2009Rowan, Hunt, et al., 2009, 2Valappil, Fan, et al., 2009Aicha, Ines, et al., 2008Baser K.H.C. and Demirci B., 2007
Comment MSDC-RI MSDC-RI MSDC-RI MSDC-RI MSDC-RI
Column type CapillaryCapillaryCapillaryCapillaryCapillary
Active phase Supelcowax-10DB-WaxHP-InnowaxHP-Innowax FSCSupelcowax-10
Column length (m) 30.30.50.60.30.
Carrier gas He HeN2He
Substrate
Column diameter (mm) 0.250.250.20.250.25
Phase thickness (μm) 0.250.250.20.250.25
Program 40C(3min) => 4C/min => 75C => 8C/min => 250C(5min)40 0C (3 min) 3 0C/min -> 150 0C (2 min) 6 0C/min -> 230 0C (10 min)40C(5min) => 2C/min => 250C (15min) => 10C/min => 270C60C(10min) => 4C/min => 220C => (10min) => 1C/min => 240C40C(3min) => 4C/min => 75C => 8C/min => 260C(5min)
I 1757.1725.1758.1758.1757.
ReferenceVichi, Guadayol, et al., 2007Wenguang, Wenlai, et al., 2007Senatore, Apostolides Arnold, et al., 2006Tabanca, Demirci, et al., 2006Vichi, Guadayol, et al., 2006
Comment MSDC-RI MSDC-RI MSDC-RI MSDC-RI MSDC-RI
Column type CapillaryCapillaryCapillaryCapillaryCapillary
Active phase HP-InnowaxHP-Innowax FSCHP-InnowaxHP-Innowax FSCHP-Innowax FSC
Column length (m) 60.60.60.60.60.
Carrier gas N2N2N2HeHe
Substrate
Column diameter (mm) 0.250.250.250.250.25
Phase thickness (μm) 0.250.250.250.250.25
Program 60C(10min) => 4C/min => 220C (10min) => 1C/min => 240C60C(10min) => 4C/min => 220C (10min) => 1C/min => 240C60C(10min) => 4C/min => 220C(10min) => 1C/min => 240C60C(10min) => 4C/min => 220C(10min) => 1C/min => 240C60C(10min) => 4C/min => 220C(10min) => 1C/min => 240C
I 1758.1758.1758.1758.1758.
ReferenceDemirci, Demirci, et al., 2005Demirci, Demirci, et al., 2005, 2Duman, Kartal, et al., 2005Sezik E., Kocakulak E., et al., 2005Viljoen, Subramoney, et al., 2005
Comment MSDC-RI MSDC-RI MSDC-RI MSDC-RI MSDC-RI
Column type CapillaryCapillaryCapillaryCapillaryCapillary
Active phase HP-Innowax FSCHP-Innowax FSCCarbowax 20MHP-Innowax FSCInnowax
Column length (m) 60.60. 60.60.
Carrier gas HeHe  He
Substrate
Column diameter (mm) 0.250.25 0.250.25
Phase thickness (μm) 0.250.25 0.250.25
Program 60C(10min) => 4C/min => 220C(10min) => 1C/min => 240C60C(10min) => 4C/min => 220C(10min) => 1C/min => 240Cnot specified60C(10min) => 4C/min => 220C(10min) => 1C/min => 240C60 0C (10 min) 4 K/min -> 220 0C (10 min) 1 K/min -> 240 0C
I 1758.1758.1750.1755.1760.
ReferenceKivcak, Akay, et al., 2004Kivcak, Akay, et al., 2004Vinogradov, 2004Tabanca, Kirimer, et al., 2001Baser, Tabanca, et al., 2000
Comment MSDC-RI MSDC-RI MSDC-RI MSDC-RI MSDC-RI
Column type CapillaryCapillaryCapillaryCapillaryCapillary
Active phase FFAPDB-WaxPolyethylene GlycolDB-WaxCarbowax 20M
Column length (m) 50.60. 60.
Carrier gas N2Helium
Substrate
Column diameter (mm) 0.20.32 0.32
Phase thickness (μm) 0.330.25
Program 70C(1min) => 3C/min => 142C(2min) => 25C/min => 230C(5min)not specifiednot specifiednot specifiednot specified
I 1768.1756.1736.1745.1763.
ReferenceLopez, Lavilla, et al., 2000Paniandy, Chane-Ming, et al., 2000Vernin, Metzger, et al., 1990Binder and Flath, 1989Hamilton-Kemp, Rodrigues, et al., 1989
Comment MSDC-RI MSDC-RI MSDC-RI MSDC-RI MSDC-RI

Kovats' RI, non-polar column, temperature ramp

Data compiled by: NIST Mass Spectrometry Data Center, William E. Wallace, director

Column type CapillaryCapillaryCapillaryCapillaryCapillary
Active phase HP-5BP-1CP Sil 8 CBDB-1DB-5
Column length (m) 25.25.30.50.30.
Carrier gas  N2H2N2He
Substrate
Column diameter (mm) 0.20.320.250.250.25
Phase thickness (μm) 0.330.250.250.250.25
Tstart (C) 60.60.50.95.60.
Tend (C) 240.220.220.240.240.
Heat rate (K/min) 3.5.3.4.3.
Initial hold (min)   2.
Final hold (min)  13.  30.
I 1509.1497.1499.1505.1509.
ReferenceOliveira, Leitao, et al., 2006Raina, Verma, et al., 2006Schwob, Bessiere, et al., 2004Velasco-Negueruela, Sanz, et al., 2004Marongiu, Piras, et al., 2003
Comment MSDC-RI MSDC-RI MSDC-RI MSDC-RI MSDC-RI
Column type CapillaryCapillaryCapillaryCapillaryCapillary
Active phase PTE-5PTE-5DB-5DB-1HP-1
Column length (m) 60.60.30.50.50.
Carrier gas H2H2H2N2He
Substrate
Column diameter (mm) 0.320.320.200.250.25
Phase thickness (μm) 0.390.39 0.250.25
Tstart (C) 60.60.60.80.100.
Tend (C) 285.285.240.225.250.
Heat rate (K/min) 4.34.33.4.5.
Initial hold (min)     7.
Final hold (min)
I 1510.1511.1505.1485.1495.
ReferenceGudzic, Dordevic, et al., 2001Gudzic, Dordevic, et al., 2001Moreira, Sousa, et al., 2001Palá-Paúl, Velasco-Negueruela, et al., 2001Raina, Srivastava, et al., 2001
Comment MSDC-RI MSDC-RI MSDC-RI MSDC-RI MSDC-RI
Column type CapillaryCapillaryCapillaryCapillaryCapillary
Active phase DB-5SE-54HP-5MSDB-5DB-5
Column length (m) 30.50.30.30.30.
Carrier gas He HeHeHe
Substrate
Column diameter (mm) 0.260.210.250.260.25
Phase thickness (μm) 0.25 0.250.250.25
Tstart (C) 60.80.60.60.60.
Tend (C) 240.200.280.246.240.
Heat rate (K/min) 3.2.3.3.3.
Initial hold (min)
Final hold (min)
I 1508.1522.1507.1508.1508.
ReferenceAdams, 2000Janzanntti, Franco, et al., 2000Roussis, Tsoukatou, et al., 2000Adams, 1999da Silva, Andrade, et al., 1999
Comment MSDC-RI MSDC-RI MSDC-RI MSDC-RI MSDC-RI
Column type CapillaryCapillaryCapillaryCapillaryCapillary
Active phase DB-5DB-5DB-5OV-101SE-30
Column length (m) 30.30.30.50.25.
Carrier gas HeHeHeN2N2
Substrate
Column diameter (mm) 0.250.250.250.250.2
Phase thickness (μm) 0.250.250.250.2
Tstart (C) 60.40.60.80.60.
Tend (C) 240.250.240.200.180.
Heat rate (K/min) 4.2.4.2.3.
Initial hold (min)  5.  10.
Final hold (min)  20. 60.1.
I 1509.1522.1504.1495.1499.
Referenceda Silva, Zoghbi, et al., 1999de Feo, Porta, et al., 1998Zoghbi, Andrade, et al., 1998Padrayuttawat, Tamura, et al., 1996Jantan, Ali, et al., 1995
Comment MSDC-RI MSDC-RI MSDC-RI MSDC-RI MSDC-RI
Column type CapillaryCapillaryCapillaryCapillaryCapillary
Active phase DB-1DB-1DB-1DB-1OV-101
Column length (m) 60.60.60.60.100.
Carrier gas HeHeHeHeH2
Substrate
Column diameter (mm) 0.320.320.320.320.3
Phase thickness (μm) 0.250.250.250.250.15
Tstart (C) 30.30.30.30.90.
Tend (C) 210.210.210.210.220.
Heat rate (K/min) 2.2.2.2.2.
Initial hold (min) 4.4.4.4.
Final hold (min)
I 1495.1496.1500.1495.1498.
ReferenceTakeoka, Buttery, et al., 1992Takeoka, Buttery, et al., 1992Takeoka, Buttery, et al., 1992Takeoka, Buttery, et al., 1992Gaydou, Randriamiharisoa, et al., 1986
Comment MSDC-RI MSDC-RI MSDC-RI MSDC-RI MSDC-RI
Column type Capillary
Active phase OV-101
Column length (m) 70.
Carrier gas N2
Substrate
Column diameter (mm) 0.28
Phase thickness (μm)
Tstart (C) 80.
Tend (C) 200.
Heat rate (K/min) 2.
Initial hold (min)
Final hold (min)
I 1495.
ReferenceYamaguchi and Shibamoto, 1979
Comment MSDC-RI

References

Karlsson, Birgersson, et al., 2009
Karlsson, M.F.; Birgersson, G.; Prado, A.M.C.; Bosa, F.; Bengtsson, M.; Witzgall, P., Plant Odor Analysis of Potato: Responce of Guatemalan Moth to Above- and Background Potato Volatiles, J. Agric. Food Chem., 2009, 57, 13, 5903-5909, https://doi.org/10.1021/jf803730h . [all data]

Museli, Pau, et al., 2009
Museli, A.; Pau, M.; Desjobert, J.-M.; Foddai, M.; Usai, M.; Costa, J., Volatile constituents of Achllea ligustica All. by HS-SPME/GC/GC-MS. Comparison with essential oils obtained by hydrodistillation from Corsica and Sardinia, Chromatographia, 2009, 69, 5/6, 575-585, https://doi.org/10.1365/s10337-008-0939-1 . [all data]

Shimizu, Imayoshi, et al., 2009
Shimizu, Y.; Imayoshi, Y.; Kato, M.; Maeda, K.; Iwabuchi, H.; Shimomura, K., Volatiles from leaves of field-grown plants and shoot cultures of Gynura bicolor DC, Flavour Fragr. J., 2009, 24, 5, 251-258, https://doi.org/10.1002/ffj.1938 . [all data]

Hymete, Rohloff, et al., 2007
Hymete, A.; Rohloff, J.; Iversen, T.-H.; Kjosen, H., Volatile constituents of the roots of Echinops kebericho Mesfin, Flavour Fragr. J., 2007, 22, 1, 35-38, https://doi.org/10.1002/ffj.1746 . [all data]

Miyazawa and Tamura, 2007
Miyazawa, M.; Tamura, N., Components of the essential oil from sprouts of Polygonum hydropiper L. ('Benitade'), Flavour Fragr. J., 2007, 22, 3, 188-190, https://doi.org/10.1002/ffj.1779 . [all data]

Raal, Orav, et al., 2007
Raal, A.; Orav, A.; Arak, E.; Kailas, T.; Müürisepp, M., Variation in the composition of the essential oil of Valeriana officinalis L. roots from Estonia, Proc. Est. Acad. Sci. Chem., 2007, 56, 2, 67-74. [all data]

Sylvestre, Pichette, et al., 2007
Sylvestre, M.; Pichette, A.; Longtin, A.; Martin, M.-A.C.; Bercion, S.R.; Legault, J., Chemical composition of leaf essential oil of Hedyosmum arborescens and evaluation of its anticancer activity, Natural Product Communications, 2007, 2, 12, 1269-1272. [all data]

Wei A. and Shibamoto T., 2007
Wei A.; Shibamoto T., Antioxidant activities and volatile constituents of various essential oils, J. Agric. Food Chem., 2007, 55, 5, 1737-1742, https://doi.org/10.1021/jf062959x . [all data]

Borges, Rojas, et al., 2006
Borges, R.; Rojas, L.B.; Cegarra, J.A.; Usubillaga, A., Study of the essential oils from the leaves and flowers of Lepechinia conferta (Benth) Epl., Flavour Fragr. J., 2006, 21, 1, 155-157, https://doi.org/10.1002/ffj.1550 . [all data]

Cai, Lin, et al., 2006
Cai, J.; Lin, P.; Zhu, X.; Su, Q., Comparative analysis of clary sage (S. sclarea L.) oil volatiles by GC-FTIR and GC-MS, Food Chem., 2006, 99, 2, 401-407, https://doi.org/10.1016/j.foodchem.2005.07.041 . [all data]

Fanciullino, Tomi, et al., 2006
Fanciullino, A.-L.; Tomi, F.; Luro, F.; Desjobert, J.M.; Casanova, J., Chemical variability of peel and leaf oils of mandarins, Flavour Fragr. J., 2006, 21, 2, 359-367, https://doi.org/10.1002/ffj.1658 . [all data]

Garneau F.X., Collin G., et al., 2006
Garneau F.X.; Collin G.; Gagnon H.; Jean F.I.; Strobl H.; Pichette A., The essential oil composition of Devil's Club, Oplopanax horridus J. E. Smith Miq., Flavour Fragr. J., 2006, 21, 5, 792-794, https://doi.org/10.1002/ffj.1716 . [all data]

Hymete, Rohloff, et al., 2006
Hymete, A.; Rohloff, J.; Iversen, T.-H., Essential oil from seeds and husks of Aframomum corrorima from Ethiopia, Flavour Fragr. J., 2006, 21, 4, 642-644, https://doi.org/10.1002/ffj.1634 . [all data]

Lan Phi N.T., Nishiyama C., et al., 2006
Lan Phi N.T.; Nishiyama C.; Choi H.-S.; Sawamura M., Evaluation of aroma characteristic compounds of Citrus natsudaidai Hayata (Natsudaidai) cold-pressed peel oil, Biosci. Biotechnol. Biochem., 2006, 70, 8, 1832-1838, https://doi.org/10.1271/bbb.50705 . [all data]

Joichi, Yomogida, et al., 2005
Joichi, A.; Yomogida, K.; Awano, K.; Ueda, Y., Volatile components of tea-scented modern roses and ancient Chinese roses, Flavour Fragr. J., 2005, 20, 2, 152-157, https://doi.org/10.1002/ffj.1388 . [all data]

Njoroge, Koaze, et al., 2005
Njoroge, S.M.; Koaze, H.; Mwaniki, M.; Minh Tu, N.T.; Sawamura, M., Essential oils of Kenyan Citrus fruits: volatile components of two varieties of mandarins (Citrus reticulata) and a tangelo (C. paradisi × C. tangerina), Flavour Fragr. J., 2005, 20, 1, 74-79, https://doi.org/10.1002/ffj.1376 . [all data]

Njoroge, Koaze, et al., 2005, 2
Njoroge, S.M.; Koaze, H.; Karanja, P.N.; Sawamura, M., Essential oil constituents of three varieties of Kenyan sweet oranges (Citrus sinensis), Flavour Fragr. J., 2005, 20, 1, 80-85, https://doi.org/10.1002/ffj.1377 . [all data]

Qian and Wang, 2005
Qian, M.C.; Wang, Y., Seasonal Variations of Volatile Composition and Odor Activity Value of Marion (Rubus spp. hyb) and Thornless Evergreen (R.laciniatus L.) Blackberries, J. Food. Sci., 2005, 70, 1, c13-c20, https://doi.org/10.1111/j.1365-2621.2005.tb09013.x . [all data]

Wong and Tan, 2005
Wong, K.C.; Tan, C.H., Volatile constituents of the flowers of Clerodendron fragrans (Vent.) R. Br., Flavour Fragr. J., 2005, 20, 4, 429-430, https://doi.org/10.1002/ffj.1457 . [all data]

Jiang and Kubota, 2004
Jiang, L.; Kubota, K., Differences in the volatile components and their odor characteristics of green and ripe fruits and dried pericarp of Japanese pepper (Xanthoxylum piperitum DC.), J. Agric. Food Chem., 2004, 52, 13, 4197-4203, https://doi.org/10.1021/jf030663a . [all data]

Orav, Stulova, et al., 2004
Orav, A.; Stulova, I.; Kailas, T.; Müürisepp, M., Effect of storage on the essential oil composition of piper nigrum L. fruits of different ripening states, J. Agric. Food Chem., 2004, 52, 9, 2582-2586, https://doi.org/10.1021/jf030635s . [all data]

Palá-Paúl, Brophy, et al., 2004
Palá-Paúl, J.; Brophy, J.J.; Goldsack, R.J.; Fontaniella, B., Analysis of the volatile components of Lavandula canariensis (L.) Mill., a Canary Islands endemic species, growing in Australia, Biochem. Syst. Ecol., 2004, 32, 1, 55-62, https://doi.org/10.1016/S0305-1978(03)00177-7 . [all data]

Raal, Paaver, et al., 2004
Raal, A.; Paaver, U.; Arak, E.; Orav, A., Content and composition of the essential oil of Thymus serpyllum L. growing wild in Estonia, Medicina (Kaunas), 2004, 40, 8, 795-800. [all data]

Bertoli, Menichini, et al., 2003
Bertoli, A.; Menichini, F.; Mazzetti, M.; Spinelli, G.; Morelli, I., Volatile constituents of the leaves and flowers of Hypericum triquetrifolium Turra, Flavour Fragr. J., 2003, 18, 2, 91-94, https://doi.org/10.1002/ffj.1161 . [all data]

Miyazawa, Teranishi, et al., 2003
Miyazawa, M.; Teranishi, A.; Ishikawa, Y., Components of the essential oil from Petasites japonicus, Flavour Fragr. J., 2003, 18, 3, 231-233, https://doi.org/10.1002/ffj.1203 . [all data]

Mookdasanit, Tamura, et al., 2003
Mookdasanit, J.; Tamura, H.; Yoshizawa T.; Tokunaga T.; Nakanishi, K., Trace Volatile Compounds in Essential Oil of Citrus Sudachi by Means of Modified Solvent Extraction Method, Food Sci Technol. Res., 2003, 9, 1, 54-61, https://doi.org/10.3136/fstr.9.54 . [all data]

Raal, Arak, et al., 2003
Raal, A.; Arak, E.; Orav, A.; Ivask, K., Comparison of essential oil content of Matricaria recutita L. from different origins, Ars Pharm., 2003, 44, 2, 159-165, retrieved from http://www.ugr.es/~ars/abstract/44-159-03.pdf. [all data]

Stashenko, Jaramillo, et al., 2003
Stashenko, E.E.; Jaramillo, B.E.; Martínez, J.R., Comparación de la composición química y de la actividad antioxidante in vitro de los metabolitos secundarios volátiles de plantas de la familia verbenaceae, Rev. Acad. Colomb. Cienc. Exactas Fis. Nat., 2003, 27, 105, 579-597. [all data]

Suleimenov, Atazharova, et al., 2003
Suleimenov, E.M.; Atazharova, G.A.; Demirchi, B.; Baser, K.H.C.; Adekenov, S.M., Essential oil composition of Artemisia Lercheana and A. Sieversiana of Kazakhstan flora in Recent problems of development of new medicines of natural origin, Proceedings of symposium, St.Petersburg - Pushkin, 2003, 382-385. [all data]

Tu, Onishi, et al., 2003
Tu, N.T.M.; Onishi, Y.; Son, U.S.; Ogawa, E.; Ukeda, H.; Sawamura, M., Characteristic odour components of Citrus inflata Hort. Ex Tanaka (Mochiyu) cold-pressed peel oil, Flavour Fragr. J., 2003, 18, 5, 454-459, https://doi.org/10.1002/ffj.1252 . [all data]

Vichi, Castellote, et al., 2003
Vichi, S.; Castellote, A.I.; Pizzale, L.; Conte, L.S.; Buxaderas, S.; López-Tamames, E., Analysis of virgin olive oil volatile compounds by headspace solid-phase microextraction coupled to gas chromatography with mass spectrometric and flame ionization detection, J. Chromatogr. A, 2003, 983, 1-2, 19-33, https://doi.org/10.1016/S0021-9673(02)01691-6 . [all data]

Vichi, Pizzale, et al., 2003
Vichi, S.; Pizzale, L.; Conte, L.S.; Buxaderas, S.; López-Tamames, E., Solid-phase microextraction in the analysis of virgin olive oil volatile fraction: modifications induced by oxidation and suitable markers of oxidative status, J. Agric. Food Chem., 2003, 51, 22, 6564-6571, https://doi.org/10.1021/jf030268k . [all data]

Vichi, Pizzale, et al., 2003, 2
Vichi, S.; Pizzale, L.; Conte, L.S.; Buxaderas, S.; López-Tamames, E., Solid-phase microextraction in the analysis of virgin olive oil volatile fraction: characterization of virgin olive oils from two distinct geographical areas of Northern Italy, J. Agric. Food Chem., 2003, 51, 22, 6572-6577, https://doi.org/10.1021/jf030269c . [all data]

Gancel, Ollé, et al., 2002
Gancel, A.-L.; Ollé, D.; Ollitrault, P.; Luro, F.; Brillouet, J.-M., Leaf and peel volatile compounds of an interspecific citrus somatic hybrid [Citrus aurantifolia (Christm.) Swing. + Citrus paradisi Macfayden], Flavour Fragr. J., 2002, 17, 6, 416-424, https://doi.org/10.1002/ffj.1119 . [all data]

Tu, Thanh, et al., 2002
Tu, N.T.M.; Thanh, L.X.; Une, A.; Ukeda, H.; Sawamura, M., Volatile constituents of Vietnamese pummelo, orange, tangerine and lime peel oils, Flavour Fragr. J., 2002, 17, 3, 169-174, https://doi.org/10.1002/ffj.1076 . [all data]

Christoph, 2001
Christoph, F., Chemische Zuzammensetzung und antimikrobielle Eigenschaften der ätherischen Öle von Leptospermum scoparium J. R. et G. Forst. und anderer Teebaumöle der Gattungen Kunzea, Leptospermum und Melaleuca unter besonderer Berücksichtigung von Handelsölen, Dissertation, University of Hamburg, Germany, 2001, 196. [all data]

Jirovetz L., Buchbauer G., et al., 2001
Jirovetz L.; Buchbauer G.; Shafi P.M.; Rosamma M.K.; Geissler M., Analysis of the composition and aroma of the essential leaf oil of Syzygium travancoricum from South India by GC-FID, GC-MS, and olfactometry. Seasonal changes of composition, Chromatographia Sup., 2001, 53, S1, s372-s374, https://doi.org/10.1007/BF02490359 . [all data]

Orav, Kailas, et al., 2001
Orav, A.; Kailas, T.; Ivask, K., Volatile constituents of Matricaria recutita L. from Estonia, Proc. Est. Acad. Sci. Chem., 2001, 50, 39-45. [all data]

Buttery, Light, et al., 2000
Buttery, R.G.; Light, D.M.; Nam, Y.; Merrill, G.B.; Roitman, J.N., Volatile components of green walnut husks, J. Agric. Food Chem., 2000, 48, 7, 2858-2861, https://doi.org/10.1021/jf000288b . [all data]

Franco and Shibamoto, 2000
Franco, M.R.B.; Shibamoto, T., Volatile composition of some Brazilian fruits: umbu-caja (Spondias citherea), camu-camu (Myrciaria dubia), araca-boi (Eugenia stipitata), and cupuacu (Theobroma grandiflorum), J. Agric. Food Chem., 2000, 48, 4, 1263-1265, https://doi.org/10.1021/jf9900074 . [all data]

Kim, Kim, et al., 2000
Kim, H.-J.; Kim, K.; Kim, N.-S.; Lee, D.-S., Determination of floral fragrances of Rosa hybrida using solid-phase trapping-solvent extraction and gas chromatography-mass spectrometry, J. Chromatogr. A, 2000, 902, 2, 389-404, https://doi.org/10.1016/S0021-9673(00)00863-3 . [all data]

Paniandy, Chane-Ming, et al., 2000
Paniandy, J.-C.; Chane-Ming, J.; Pierbattesti, J.-C., Chemical Composition of the Essential Oil and Headspace Solid-Phase Microextraction of the Guava Fruit (Psidium guajava L.), J. Essent. Oil Res., 2000, 12, 153-158. [all data]

Umano, Hagi, et al., 2000
Umano, K.; Hagi, Y.; Nakahara, K.; Shoji, A.; Shibamoto, T., Volatile chemicals identified in extracts from leaves of Japanese mugwort (Artemisia princeps Pamp.), J. Agric. Food Chem., 2000, 48, 8, 3463-3469, https://doi.org/10.1021/jf0001738 . [all data]

Kaya, Baser, et al., 1999
Kaya, A.; Baser, K.H.C.; Demirci, B.; Koca, F., The essential oil of Acinos alpinus (L.) Moench growing in Turkey, Flavour Fragr. J., 1999, 14, 1, 55-59, https://doi.org/10.1002/(SICI)1099-1026(199901/02)14:1<55::AID-FFJ784>3.0.CO;2-Q . [all data]

Kaya, Baser, et al., 1999, 2
Kaya, A.; Baser, K.H.C.; Tümen, G.; Koca, F., The essential oil of Acinos suaveolens (Sm.) G. Don fil. Acinos arvensis (Lam.) Dandy and Acinos rotundifolius Pers. growing wild in Turkey, Flavour Fragr. J., 1999, 14, 1, 60-64, https://doi.org/10.1002/(SICI)1099-1026(199901/02)14:1<60::AID-FFJ785>3.0.CO;2-0 . [all data]

Lamarque, Maestri, et al., 1998
Lamarque, A.L.; Maestri, D.M.; Zygadlo, J.A.; Grosso, N.R., Volatile constituents from flowers of Acacia caven (Mol.) Mol. var. caven, Acacia aroma Gill. ex Hook., Erythrina crista-galli L. and Calliandra tweedii Benth., Flavour Fragr. J., 1998, 13, 4, 266-268, https://doi.org/10.1002/(SICI)1099-1026(1998070)13:4<266::AID-FFJ739>3.0.CO;2-5 . [all data]

Tümen, Baser, et al., 1998
Tümen, G.; Baser, K.H.C.; Demirci, B.; Ermin, N., The essential oils of Satureja coerulea Janka and Thymus aznavourii Velen., Flavour Fragr. J., 1998, 13, 1, 65-67, https://doi.org/10.1002/(SICI)1099-1026(199801/02)13:1<65::AID-FFJ695>3.0.CO;2-Q . [all data]

Werkhoff, Güntert, et al., 1998
Werkhoff, P.; Güntert, M.; Krammer, G.; Sommer, H.; Kaulen, J., Vacuum headspace method in aroma research: flavor chemistry of yellow passion fruits, J. Agric. Food Chem., 1998, 46, 3, 1076-1093, https://doi.org/10.1021/jf970655s . [all data]

Awano, Ichikawa, et al., 1997
Awano, K.; Ichikawa, Y.; Tokuda, K.; Kuraoka, M., Volatile components of the flowers of two Calanthe species, Flavour Fragr. J., 1997, 12, 5, 327-330, https://doi.org/10.1002/(SICI)1099-1026(199709/10)12:5<327::AID-FFJ661>3.0.CO;2-M . [all data]

Wong and Lai, 1996
Wong, K.C.; Lai, F.Y., Volatile constituents from the fruits of four Syzygium species grown in Malaysia, Flavour Fragr. J., 1996, 11, 1, 61-66, https://doi.org/10.1002/(SICI)1099-1026(199601)11:1<61::AID-FFJ539>3.0.CO;2-1 . [all data]

Girard and Lau, 1995
Girard, B.; Lau, O.L., Effect of maturity and storage on quality and volatile production of 'Jonagold' apples, Food Res. Int., 1995, 28, 5, 465-471, https://doi.org/10.1016/0963-9969(96)81393-7 . [all data]

Kawakami, Ganguly, et al., 1995
Kawakami, M.; Ganguly, S.N.; Banerjee, J.; Kobayashi, A., Aroma composition of oolong tea and black tea by brewed extraction method and characterizing compounds of Darjeeling tea aroma, J. Agric. Food Chem., 1995, 43, 1, 200-207, https://doi.org/10.1021/jf00049a037 . [all data]

Stashenko, Torres, et al., 1995
Stashenko, E.E.; Torres, W.; Morales, J.R.M., A study of the compositional variation of the essential oil of ylang-ylang (Cananga odorata Hook Fil. et Thomson, forma genuina) during flower development, J. Hi. Res. Chromatogr., 1995, 18, 2, 101-104, https://doi.org/10.1002/jhrc.1240180206 . [all data]

Togari, Kobayashi, et al., 1995
Togari, N.; Kobayashi, A.; Aishima, T., Pattern recognition applied to gas chromatographic profiles of volatile components in three tea categories, Food Res. Int., 1995, 28, 5, 495-502, https://doi.org/10.1016/0963-9969(95)00029-1 . [all data]

Kollmannsberger, Nitz, et al., 1992
Kollmannsberger, H.; Nitz, S.; Drawert, F., UBer die Aromastoffzusammensetzung von Hochdruckextrakten. I. Pfeffer (Piper nigrum, Var. muntok), Z. Lebensm. Unters Forsch., 1992, 194, 6, 545-551, https://doi.org/10.1007/BF01185481 . [all data]

Binder and Flath, 1989
Binder, R.G.; Flath, R.A., Volatile components of pineapple guava, J. Agric. Food Chem., 1989, 37, 3, 734-736, https://doi.org/10.1021/jf00087a034 . [all data]

Gaydou, Faure, et al., 1989
Gaydou, E.M.; Faure, R.; Bianchini, J.-P.; Lamaty, G.; Rakotonirainy, O.; Randriamiharisoa, R., Sesquiterpene composition of basil oil. Assignment of the 1H and 13C NMR spectra of β-elemene with two-dimensional NMR, J. Agric. Food Chem., 1989, 37, 4, 1032-1037, https://doi.org/10.1021/jf00088a048 . [all data]

Mihara, Tateba, et al., 1988
Mihara, S.; Tateba, H.; Nishimura, O.; Machii, Y.; Kishino, K., The volatile components of Chinese quince (Pseudocydonia sinensis Schneid) in Flavors and Fragrances: A World Perspective. Proceedings of the 10th International Congress of Essential Oils, Fragrances and Flavors, Lawrence,B.M.; Mookherjee,B.D.; Willis,B.J., ed(s)., Elsevier, New York, 1988, 537-550. [all data]

Ramaswami, Briscese, et al., 1988
Ramaswami, S.K.; Briscese, P.; Gargiullo, R.J.; von Geldern, T., Sesquiterpene hydrocarbons: from mass confusion to orderly line-up in Flavors and Fragrances: A World Perspective. Proceedings of the 10th International Congress of Essential Oils, Fragrances and Flavors, Lawrence,B.M.; Mookherjee,B.D.; Willis,B.J., ed(s)., Elsevier, New York, 1988, 951-980. [all data]

Mihara, Tateba, et al., 1987
Mihara, S.; Tateba, H.; Nishimura, O.; Machii, Y.; Kishino, K., Volatile components of Chinese quince (Pseudocydonia sinensis Schneid), J. Agric. Food Chem., 1987, 35, 4, 532-537, https://doi.org/10.1021/jf00076a023 . [all data]

Ramaswami, Briscese, et al., 1986
Ramaswami, S.K.; Briscese, P.; Gargiullo, R.J.; von Geldern, T., Sesquiterpene hydrocarbons: from mass confusion to orderly line-up in Flavors and Fragrances: A World Perspective, Lawrence,B.M.; Mookherjee,B.D.; Willis,B.J., ed(s)., Proceedings of the 10th International Congress of Essential Oils, Fragrances, and Flavors, Washington, DC, 1986, 951-959. [all data]

Buttery, Xu, et al., 1985
Buttery, R.G.; Xu, C.; Ling, L.C., Volatile components of wheat leaves (and stems): Possible insect attractants, J. Agric. Food Chem., 1985, 33, 1, 115-117, https://doi.org/10.1021/jf00061a033 . [all data]

Yamaguchi and Shibamoto, 1980
Yamaguchi, K.; Shibamoto, T., Volatile constituents of the chestnut flower, J. Agric. Food Chem., 1980, 28, 1, 82-84, https://doi.org/10.1021/jf60227a021 . [all data]