Benzeneethanol, 4-hydroxy-

Van Den Dool and Kratz RI, polar column, custom temperature program

Data compiled by: NIST Mass Spectrometry Data Center, William E. Wallace, director

Column type CapillaryCapillaryCapillaryCapillary
Active phase DB-WaxDB-WaxDB-WaxCarbowax 20M
Column length (m) 30.30.30.25.
Carrier gas H2H2H2H2
Substrate
Column diameter (mm) 0.320.320.320.32
Phase thickness (μm) 0.50.50.50.25
Program 60C(3min) => 2C/min => 220C => 3C/min => 245C (20min)60C(3min) => 2C/min => 220C => 3C/min => 245C(20min)60C(3min) => 2C/min => 220C => 3C/min => 245C (20min)40C (8min) => 3C/min => 180C => 20C/min => 230C
I 3012.3012.3012.2999.
ReferenceSelli, Canbas, et al., 2006Selli, Canbas, et al., 2006, 2Selli, Cabaroglu, et al., 2004Boido, Lloret, et al., 2003
Comment MSDC-RI MSDC-RI MSDC-RI MSDC-RI

Normal alkane RI, polar column, custom temperature program

Data compiled by: NIST Mass Spectrometry Data Center, William E. Wallace, director

Column type Capillary
Active phase Supelcowax-10
Column length (m) 30.
Carrier gas Helium
Substrate
Column diameter (mm) 0.25
Phase thickness (μm) 0.25
Program 45 0C 3 0C/min -> 230 0C (10 min) 10 0C/min -> 270 0C (21 min)
I 2965.
Referencede Simon, Estruelas, et al., 2009
Comment MSDC-RI

Phase change data

Data compiled as indicated in comments:
TRC - Thermodynamics Research Center, NIST Boulder Laboratories, Chris Muzny director
AC - William E. Acree, Jr., James S. Chickos

Quantity Value Units Method Reference Comment
Tfus363.KN/ABaird and Winstein, 1963Uncertainty assigned by TRC = 3. K; TRC

Enthalpy of fusion

ΔfusH (kcal/mol) Temperature (K) Method Reference Comment
6.19364.DSCQueimada, Mota, et al., 2009AC

In addition to the Thermodynamics Research Center (TRC) data available from this site, much more physical and chemical property data is available from the following TRC products:

References

Selli, Canbas, et al., 2006
Selli, S.; Canbas, A.; Cabaroglu, T.; Erten, H.; Gunata, Z., Aroma components of cv. Muscat of Bornova wines and influence of skin contact treatment, Food Chem., 2006, 94, 3, 319-326, https://doi.org/10.1016/j.foodchem.2004.11.019 . [all data]

Selli, Canbas, et al., 2006, 2
Selli, S.; Canbas, A.; Cabaroglu, T.; Erten, H.; Lepoutre, J.-P.; Gunata, Z., Effect of skin contact on the free and bound aroma compounds of the white wine of Vitis vinifera L. cv Narince, Food Control, 2006, 17, 1, 75-82, https://doi.org/10.1016/j.foodcont.2004.09.005 . [all data]

Selli, Cabaroglu, et al., 2004
Selli, S.; Cabaroglu, T.; Canbas, A.; Erten, H.; Nurgel, C.; Lepoutre, J.P.; Gunata, Z., Volatile composition of red wine from cv. Kalecik Karasi grown in central Anatolia, Food Chem., 2004, 85, 2, 207-213, https://doi.org/10.1016/j.foodchem.2003.06.008 . [all data]

Boido, Lloret, et al., 2003
Boido, E.; Lloret, A.; Medina, K.; Fariña, L.; Carrau, f.; Versini, G.; Dellacassa, E., Aroma composition of Vitis vinifera Cv. Tannat: the typical red wine from Uruguay, J. Agric. Food Chem., 2003, 51, 18, 5408-5413, https://doi.org/10.1021/jf030087i . [all data]