Phenol, 4-(2-propenyl)-

Normal alkane RI, polar column, temperature ramp

Data compiled by: NIST Mass Spectrometry Data Center, William E. Wallace, director

Column type CapillaryCapillaryCapillaryCapillaryCapillary
Active phase HP-InnowaxDB-WaxCarbowax 20MDB-WaxSupelcowax-10
Column length (m) 30.30.50.30.30.
Carrier gas NitrogenHe HeHe
Substrate
Column diameter (mm) 0.250.250.20.250.25
Phase thickness (μm) 0.250.250.250.250.25
Tstart (C) 50.40.60.50.50.
Tend (C) 280.230.250.180.220.
Heat rate (K/min) 5.4.2.3.4.
Initial hold (min) 1.2.60. 3.
Final hold (min) 1.5. 40.30.
I 2329.2346.2282.2329.2328.
ReferenceBousaada, Ammar, et al., 2008Xu, Fan, et al., 2007Fernandez, Lizzani-Cuvelier, et al., 2005Lee, Umano, et al., 2005Wong, Lee, et al., 2005
Comment MSDC-RI MSDC-RI MSDC-RI MSDC-RI MSDC-RI
Column type CapillaryCapillaryCapillary
Active phase DB-WaxSupelcowaxDB-Wax
Column length (m) 60.60.60.
Carrier gas H2HeH2
Substrate
Column diameter (mm) 0.320.250.32
Phase thickness (μm) 0.25 0.25
Tstart (C) 40.80.60.
Tend (C) 230.240.220.
Heat rate (K/min) 4.5.3.
Initial hold (min) 5.
Final hold (min) 25.
I 2338.2324.2320.
ReferenceDregus and Engel, 2003Näf and Velluz, 1998Werkhoff, Güntert, et al., 1998
Comment MSDC-RI MSDC-RI MSDC-RI

Normal alkane RI, polar column, custom temperature program

Data compiled by: NIST Mass Spectrometry Data Center, William E. Wallace, director

Column type CapillaryCapillary
Active phase DB-WaxCarbowax 20M
Column length (m) 30.
Carrier gas Hydrogen
Substrate
Column diameter (mm) 0.32
Phase thickness (μm) 0.50
Program 60 0C (3 min) 2 0C/min -> 220 0C 3 0C/min -> 245 0C (20 min)not specified
I 2316.2300.
ReferenceSelli, 2007Vinogradov, 2004
Comment MSDC-RI MSDC-RI

References

Bousaada, Ammar, et al., 2008
Bousaada, O.; Ammar, S.; Saidana, D.; Chriaa, J.; Chraif, I.; Daami, M.; Helal, A.N.; Mighri, Z., Chemical composition and antimicrobial activity of volatile components from capitula and aerial parts of Rhaponticum acaule DC growing wild in Tunisia, Microbiol. Res., 2008, 163, 1, 87-95, https://doi.org/10.1016/j.micres.2007.02.010 . [all data]

Xu, Fan, et al., 2007
Xu, Y.; Fan, W.; Qian, M.C., Characterization of Aroma Compounds in Apple Cider Using Solvent-Assisted Flavor Evaporation and Headspace Solid-Phase Microextraction, J. Agric. Food Chem., 2007, 55, 8, 3051-3057, https://doi.org/10.1021/jf0631732 . [all data]

Fernandez, Lizzani-Cuvelier, et al., 2005
Fernandez, X.; Lizzani-Cuvelier, L.; Loiseau, A.-M.; Perichet, C.; Delbecque, C.; Arnaudo, J.-F., Chemical composition of the essential oils from Turkish and Honduras Styrax, Flavour Fragr. J., 2005, 20, 1, 70-73, https://doi.org/10.1002/ffj.1370 . [all data]

Lee, Umano, et al., 2005
Lee, S.-J.; Umano, K.; Shibamoto, T.; Lee, K.-G., Identification of volatile components in basil (Ocimum basilicum L.) and thyme leaves (Thymus vulgaris L.) and their antioxidant properties, Food Chem., 2005, 91, 1, 131-137, https://doi.org/10.1016/j.foodchem.2004.05.056 . [all data]

Wong, Lee, et al., 2005
Wong, K.C.; Lee, B.C.; Lam, N.F.; Ibrahim, P., Essential oils of the rhizomes of Alpinia conchigera Griff. and Alpinia latilabris Ridl., Flavour Fragr. J., 2005, 20, 4, 431-433, https://doi.org/10.1002/ffj.1458 . [all data]

Dregus and Engel, 2003
Dregus, M.; Engel, K.-H., Volatile constituents of uncooked Rhubarb (Rheum rhabarbarum L.) stalks, J. Agric. Food Chem., 2003, 51, 22, 6530-6536, https://doi.org/10.1021/jf030399l . [all data]

Näf and Velluz, 1998
Näf, R.; Velluz, A., Phenols and lactones in Italo-Mitcham peppermint oil Mentha × piperita L., Flavour Fragr. J., 1998, 13, 3, 203-208, https://doi.org/10.1002/(SICI)1099-1026(199805/06)13:3<203::AID-FFJ725>3.0.CO;2-0 . [all data]

Werkhoff, Güntert, et al., 1998
Werkhoff, P.; Güntert, M.; Krammer, G.; Sommer, H.; Kaulen, J., Vacuum headspace method in aroma research: flavor chemistry of yellow passion fruits, J. Agric. Food Chem., 1998, 46, 3, 1076-1093, https://doi.org/10.1021/jf970655s . [all data]