3-Allyl-6-methoxyphenol

Van Den Dool and Kratz RI, non-polar column, temperature ramp

Data compiled by: NIST Mass Spectrometry Data Center, William E. Wallace, director

Column type Capillary
Active phase DB-1
Column length (m) 30.
Carrier gas N2
Substrate
Column diameter (mm) 0.32
Phase thickness (μm) 0.25
Tstart (C) 150.
Tend (C) 280.
Heat rate (K/min) 3.
Initial hold (min)
Final hold (min)
I 1350.
ReferenceCoen, Engel, et al., 1995
Comment MSDC-RI

References

Coen, Engel, et al., 1995
Coen, M.; Engel, R.; Nahrstedt, A., Chavicol β-D-glucoside, a phenylpropanoid heteroside, benzyl-β-D-glucoside and glycosidically bound volatiles from subspecies of Cedronella canariensis, Phytochemistry, 1995, 40, 1, 149-155, https://doi.org/10.1016/0031-9422(95)00241-X . [all data]