4-Hexadecylphenyl-[6-(4-hexadecylphenyl)methyl-9-methyl-9H-carbazol-3-yl-methylene)]amine

Phase change data

Data compiled by: William E. Acree, Jr., James S. Chickos

Enthalpy of fusion

ΔfusH (kJ/mol) Temperature (K) Method Reference
52.1405.2DSCBelloni, Manickam, et al., 2002

References

Belloni, Manickam, et al., 2002
Belloni, Maura; Manickam, M.; Preece, Jon A., Towards Banana-Shaped Liquid Crystals Incorporating Carbazole, Ferroelectrics, 2002, 276, 1, 103-126, https://doi.org/10.1080/00150190214420 . [all data]