Hydrocortisone Acetate

Phase change data

Data compiled by: William E. Acree, Jr., James S. Chickos

Enthalpy of fusion

ΔfusH (kJ/mol) Temperature (K) Reference
53.64480.Cenuse and Meltzer, 1997
36.95496.Regosz, Chmielewska, et al., 1994

References

Cenuse and Meltzer, 1997
Cenuse, Z.; Meltzer, V., DSC characterization of drugs containing cyclopentanophenanthrene nucleus, An. Univ. Bucuresti. Chimie, 1997, 6, 101. [all data]

Regosz, Chmielewska, et al., 1994
Regosz, A.; Chmielewska, A.; Pelplinska, T.; Kowalski, P., Prediction of the solubility of steroid hormones, Pharmazie, 1994, 49, 5, 371. [all data]