C6H3F6NO2

Gas phase ion energetics data

Data compiled by: John E. Bartmess

De-protonation reactions

C6H2F6NO2- + Hydrogen cation = C6H3F6NO2

By formula: C6H2F6NO2- + H+ = C6H3F6NO2

Quantity Value Units Method Reference Comment
Δr1357. ± 8.8kJ/molG+TSMishima, Matsuoka, et al., 2004gas phase; Calc: keto form of acid more stable.
Quantity Value Units Method Reference Comment
Δr1328. ± 8.4kJ/molIMREMishima, Matsuoka, et al., 2004gas phase; Calc: keto form of acid more stable.

References

Mishima, Matsuoka, et al., 2004
Mishima, M.; Matsuoka, M.; Lei, Y.X.; Rappoport, Z., Gas-phase acidities of disubstituted methanes and of enols of carboxamides substituted by electron-withdrawing groups, J. Org. Chem., 2004, 69, 18, 5947-5965, https://doi.org/10.1021/jo040196b . [all data]