1,4:5,8-diendomethylenedecahydrocaphthalene

Phase change data

Data compiled by: Thermodynamics Research Center, NIST Boulder Laboratories, Chris Muzny director

Quantity Value Units Method Reference Comment
Tfus309.4KN/APlate, Belikova, et al., 1961Uncertainty assigned by TRC = 0.6 K

In addition to the Thermodynamics Research Center (TRC) data available from this site, much more physical and chemical property data is available from the following TRC products:

References

Plate, Belikova, et al., 1961
Plate, A.F.; Belikova, N.A.; Kirchenko, S.Ya., Catalytic Conversions of 1,4-Endomethyleneoctahydronaphthalene and 1,4:5,8-Diendomethylenedecalin, Neftekhimiya, 1961, 1, 494-5000. [all data]