cyclohexyl(3-methylcyclohexyl)methane (high-boiling form)

Phase change data

Data compiled by: Thermodynamics Research Center, NIST Boulder Laboratories, Chris Muzny director

Quantity Value Units Method Reference Comment
Tboil537.47KN/ALamneck and Wise, 1954Uncertainty assigned by TRC = 0.2 K

In addition to the Thermodynamics Research Center (TRC) data available from this site, much more physical and chemical property data is available from the following TRC products:

References

Lamneck and Wise, 1954
Lamneck, J.H.; Wise, P.H., Dicyclic hydrocarbons. IX. Synthesis and physical properties of the monomethyldiphenylmethanes and monomethyldicyclohexylmethanes, J. Am. Chem. Soc., 1954, 76, 1104. [all data]