3-ethyl-1,1,1-triphenylheptane

Phase change data

Data compiled by: Thermodynamics Research Center, NIST Boulder Laboratories, Chris Muzny director

Quantity Value Units Method Reference Comment
Tfus293.KN/AChel'tsova and Petrov, 1957Uncertainty assigned by TRC = 5. K

In addition to the Thermodynamics Research Center (TRC) data available from this site, much more physical and chemical property data is available from the following TRC products:

References

Chel'tsova and Petrov, 1957
Chel'tsova, M.A.; Petrov, A.D., Organomagnesium Synthesis and Hydrogenation of Triphenylalkylmethanes, Zhur. Obshchei Khim., 1957, 27, 600-3. [all data]