cis-5-decenedioic acid

Phase change data

Data compiled by: Thermodynamics Research Center, NIST Boulder Laboratories, Chris Muzny director

Quantity Value Units Method Reference Comment
Tfus351.2KN/ACram and Allinger, 1956Uncertainty assigned by TRC = 3. K

In addition to the Thermodynamics Research Center (TRC) data available from this site, much more physical and chemical property data is available from the following TRC products:

References

Cram and Allinger, 1956
Cram, D.J.; Allinger, N.L., Macro Rings XIII. Synthesis and Properties of 1,7-Cyclododecadiyne and Related Compounds, J. Am. Chem. Soc., 1956, 78, 2518-24. [all data]