1-(2-ethyl-1-butenyl)-2,3,3-trimethylcyclopentene

Phase change data

Data compiled by: Thermodynamics Research Center, NIST Boulder Laboratories, Chris Muzny director

Quantity Value Units Method Reference Comment
Tboil496.KN/ABehal, 1904Uncertainty assigned by TRC = 4. K

In addition to the Thermodynamics Research Center (TRC) data available from this site, much more physical and chemical property data is available from the following TRC products:

References

Behal, 1904
Behal, A., Bull. Soc. Chim. Fr., 1904, 31, 461. [all data]