4-methyl-1-(3-methylbutyl)-1-cyclohexene

Phase change data

Data compiled by: Thermodynamics Research Center, NIST Boulder Laboratories, Chris Muzny director

Quantity Value Units Method Reference Comment
Tboil483.KN/ASabatier and Mailhe, 1906Uncertainty assigned by TRC = 4. K

In addition to the Thermodynamics Research Center (TRC) data available from this site, much more physical and chemical property data is available from the following TRC products:

References

Sabatier and Mailhe, 1906
Sabatier, P.; Mailhe, A., C. R. Hebd. Seances Acad. Sci., 1906, 142, 438. [all data]