1-(1-methylethoxy)-4-methylbenzene

Phase change data

Data compiled by: Thermodynamics Research Center, NIST Boulder Laboratories, Chris Muzny director

Quantity Value Units Method Reference Comment
Tboil471.3KN/AOlson, Hipsher, et al., 1947Uncertainty assigned by TRC = 0.3 K
Quantity Value Units Method Reference Comment
Tfus237.24KN/AOlson, Hipsher, et al., 1947Uncertainty assigned by TRC = 0.3 K

In addition to the Thermodynamics Research Center (TRC) data available from this site, much more physical and chemical property data is available from the following TRC products:

References

Olson, Hipsher, et al., 1947
Olson, W.T.; Hipsher, H.F.; Buess, C.M.; Goodman, I.A.; Hart, I.; Lamneck, J.H.; Gibbons, L.C., The Synthesis and Purification of Ethers, J. Am. Chem. Soc., 1947, 69, 2451-4. [all data]