3-pentadecyl-2-docosane

Phase change data

Data compiled by: Thermodynamics Research Center, NIST Boulder Laboratories, Chris Muzny director

Quantity Value Units Method Reference Comment
Tfus283.KN/AStaudinger and Staiger, 1935Uncertainty assigned by TRC = 5. K

In addition to the Thermodynamics Research Center (TRC) data available from this site, much more physical and chemical property data is available from the following TRC products:

References

Staudinger and Staiger, 1935
Staudinger, H.; Staiger, F., Chem. Ber., 1935, 68, 707. [all data]