N,N,N',N'-tetramethyl-1,4-butanediamide

Phase change data

Data compiled by: Thermodynamics Research Center, NIST Boulder Laboratories, Chris Muzny director

Quantity Value Units Method Reference Comment
Tfus362.KN/AKuceski, 1968Uncertainty assigned by TRC = 4. K
Tfus357.7KN/AKuceski, 1966Uncertainty assigned by TRC = 5. K

In addition to the Thermodynamics Research Center (TRC) data available from this site, much more physical and chemical property data is available from the following TRC products:

References

Kuceski, 1968
Kuceski, V.P., , 1968. [all data]

Kuceski, 1966
Kuceski, V.P., , 1966. [all data]