didecyl sulfone

Phase change data

Data compiled by: Thermodynamics Research Center, NIST Boulder Laboratories, Chris Muzny director

Quantity Value Units Method Reference Comment
Tfus362.KN/AKharasch and Zavist, 1951Uncertainty assigned by TRC = 4. K

In addition to the Thermodynamics Research Center (TRC) data available from this site, much more physical and chemical property data is available from the following TRC products:

References

Kharasch and Zavist, 1951
Kharasch, M.S.; Zavist, A.F., Reactions of Atoms and Free Radicals in Solution. XXIII. The Peroxide- Induced Addition of Sulfuryl Chloride to 1-Alkenes, J. Am. Chem. Soc., 1951, 73, 964. [all data]