4-methylpentatriacontane

Phase change data

Data compiled by: Thermodynamics Research Center, NIST Boulder Laboratories, Chris Muzny director

Quantity Value Units Method Reference Comment
Tfus336.2KN/AStallberg-Stenhagen and Stenhagen, 1948Crystal phase 1 phase; Uncertainty assigned by TRC = 0.3 K

In addition to the Thermodynamics Research Center (TRC) data available from this site, much more physical and chemical property data is available from the following TRC products:

References

Stallberg-Stenhagen and Stenhagen, 1948
Stallberg-Stenhagen, S.; Stenhagen, E., J. Biol. Chem., 1948, 173, 383. [all data]