2,3,4,5-tetramethyl-1,3,5-hexatriene

Phase change data

Data compiled by: Thermodynamics Research Center, NIST Boulder Laboratories, Chris Muzny director

Quantity Value Units Method Reference Comment
Tboil428.KN/APetrov and Melekhin, 1955Uncertainty assigned by TRC = 4. K

In addition to the Thermodynamics Research Center (TRC) data available from this site, much more physical and chemical property data is available from the following TRC products:

References

Petrov and Melekhin, 1955
Petrov, A.D.; Melekhin, V.M., Synthesis of Branched Aliphatic Hydrocarbons of Comsition C11 - C16 from β-Alkenyl Halides, Zh. Obshch. Khim., 1955, 25, 1327-34. [all data]