9-methyl-8-heptadecene

Phase change data

Data compiled by: Thermodynamics Research Center, NIST Boulder Laboratories, Chris Muzny director

Quantity Value Units Method Reference Comment
Tfus247.KN/APetrov, 1941Uncertainty assigned by TRC = 4. K

In addition to the Thermodynamics Research Center (TRC) data available from this site, much more physical and chemical property data is available from the following TRC products:

References

Petrov, 1941
Petrov, A.D., Izv. Akad. Nauk SSSR, 1941, 1941, 533. [all data]