hexadecyl 2-propenoate

Phase change data

Data compiled by: Thermodynamics Research Center, NIST Boulder Laboratories, Chris Muzny director

Quantity Value Units Method Reference Comment
Tfus297.KN/ARehberg and Fisher, 1944Uncertainty assigned by TRC = 3. K

In addition to the Thermodynamics Research Center (TRC) data available from this site, much more physical and chemical property data is available from the following TRC products:

References

Rehberg and Fisher, 1944
Rehberg, C.E.; Fisher, C.H., Preparatioon and Properties of the n-Alkyl Acrylates, J. Am. Chem. Soc., 1944, 66, 1203-7. [all data]