7,8-di(3-methylbutyl)tetradecane

Phase change data

Data compiled by: Thermodynamics Research Center, NIST Boulder Laboratories, Chris Muzny director

Quantity Value Units Method Reference Comment
Tfus228.KN/APetrov and Ol'dekop, 1948Uncertainty assigned by TRC = 3. K

In addition to the Thermodynamics Research Center (TRC) data available from this site, much more physical and chemical property data is available from the following TRC products:

References

Petrov and Ol'dekop, 1948
Petrov, A.D.; Ol'dekop, Y.A., Zh. Obshch. Khim., 1948, 18, 859. [all data]