4-isopropyldiphenylmethane

Phase change data

Data compiled by: Thermodynamics Research Center, NIST Boulder Laboratories, Chris Muzny director

Quantity Value Units Method Reference Comment
Tboil578.75KN/ALamneck and Wise, 1954Uncertainty assigned by TRC = 0.3 K
Quantity Value Units Method Reference Comment
Tfus259.79KN/ALamneck and Wise, 1954Uncertainty assigned by TRC = 0.2 K

In addition to the Thermodynamics Research Center (TRC) data available from this site, much more physical and chemical property data is available from the following TRC products:

References

Lamneck and Wise, 1954
Lamneck, J.H.; Wise, P.H., Dicyclic Hydrocarbons X. Synthesis and Physical Properties of SOme Propyl- and Butyldiphenylmethanes and 4-Isopropyldicyclohexylmethane, J. Am. Chem. Soc., 1954, 76, 3475-6. [all data]