28,28-diethyl-23,33-didocosyltetrapentacontane

Phase change data

Data compiled by: Thermodynamics Research Center, NIST Boulder Laboratories, Chris Muzny director

Quantity Value Units Method Reference Comment
Tfus321.2KN/AKorosi and Kovats, 1981Uncertainty assigned by TRC = 1.5 K
Tfus322.9KN/AZeltner, Huber, et al., 1979Uncertainty assigned by TRC = 0.6 K

In addition to the Thermodynamics Research Center (TRC) data available from this site, much more physical and chemical property data is available from the following TRC products:

References

Korosi and Kovats, 1981
Korosi, G.; Kovats, E., Density and Surface Tension of 83 Organic Liquids, J. Chem. Eng. Data, 1981, 26, 323. [all data]

Zeltner, Huber, et al., 1979
Zeltner, P.; Huber, G.A.; Peters, R.; Tatrai, F.; Boksanyi, L.; Kovats, E.S., Preparation of Branched Paraffins in the Oligomer Range, Helv. Chim. Acta, 1979, 62, 2495. [all data]