4-butyl-1,10-undecadiene

Phase change data

Data compiled by: Thermodynamics Research Center, NIST Boulder Laboratories, Chris Muzny director

Quantity Value Units Method Reference Comment
Tboil521.7KN/AGibbons, 1941Uncertainty assigned by TRC = 2. K

In addition to the Thermodynamics Research Center (TRC) data available from this site, much more physical and chemical property data is available from the following TRC products:

References

Gibbons, 1941
Gibbons, L.C., , Ph.D. Thesis, Ohio State Univ., Columbus, OH, 1941. [all data]