1-butoxy-2-propoxyethane

Phase change data

Data compiled by: Thermodynamics Research Center, NIST Boulder Laboratories, Chris Muzny director

Quantity Value Units Method Reference Comment
Tboil458.15KN/AKusano, 1978Uncertainty assigned by TRC = 1.3 K; accompanied by decomposition

In addition to the Thermodynamics Research Center (TRC) data available from this site, much more physical and chemical property data is available from the following TRC products:

References

Kusano, 1978
Kusano, K., Densities, Refractive Indexes, and Normal Boiling Points of 1,2-Disubstituted Ethylene Glycol Derivatives, J. Chem. Eng. Data, 1978, 23, 141. [all data]