2,5-Dioxaoctane

Condensed phase thermochemistry data

Data compiled by: Eugene S. Domalski and Elizabeth D. Hearing

Constant pressure heat capacity of liquid

Cp,liquid (J/mol*K) Temperature (K) Reference
248.9298.15Kusano, Suurkuusk, et al., 1973

References

Kusano, Suurkuusk, et al., 1973
Kusano, K.; Suurkuusk, J.; Wads, I., Thermochemistry of solutions of biochemical model compounds. 2. Alkoxyethanols and 1,2-dialkoxyethanes in water, J. Chem. Thermodynam. 5,757-767 (1973).73LEB/TSV Lebedev, B.V., Tsvetkova, L.Ya., and Rabinovich, I.B., Specific heat and thermodynamic functions of poly(vinyltrimethylsilane), Tr. Khim. Khim. Tekhnol., 1973, (1), 17-18. [all data]