2,4-dimethyl-3-ethyl-2-pentene

Phase change data

Data compiled by: Thermodynamics Research Center, NIST Boulder Laboratories, Chris Muzny director

Quantity Value Units Method Reference Comment
Tboil403.12KN/AHoward, Mears, et al., 1947Uncertainty assigned by TRC = 0.1 K
Tboil400.KN/AHuston and Awuapara, 1944Uncertainty assigned by TRC = 4. K
Quantity Value Units Method Reference Comment
Tfus189.65KN/AHoward, Mears, et al., 1947Uncertainty assigned by TRC = 0.1 K

In addition to the Thermodynamics Research Center (TRC) data available from this site, much more physical and chemical property data is available from the following TRC products:

References

Howard, Mears, et al., 1947
Howard, F.L.; Mears, T.W.; Fookson, A.; Pomerantz, P.; Brooks, D.B., Preparation and physical properties of several aliphatic hydrocarbons and intermediates, J. Res. Natl. Bur. Stand. (U. S.), 1947, 38, 365. [all data]

Huston and Awuapara, 1944
Huston, R.C.; Awuapara, J., Fragmentation of Alcohols in the Presence of AlCl3 I. 2,3,4-Trimethyl-3- pentanol and 2,4-Dimethyl-3-ethyl-3-pentanol, J. Org. Chem., 1944, 9, 401. [all data]