1,3,5-trimethylhexyl acetate

Phase change data

Data compiled by: Thermodynamics Research Center, NIST Boulder Laboratories, Chris Muzny director

Quantity Value Units Method Reference Comment
Tboil474.65KN/AGuerbet, 1909Uncertainty assigned by TRC = 1. K

In addition to the Thermodynamics Research Center (TRC) data available from this site, much more physical and chemical property data is available from the following TRC products:

References

Guerbet, 1909
Guerbet, M., C. R. Hebd. Seances Acad. Sci., 1909, 149, 129. [all data]