2,4,6-Cycloheptatrien-1-one, 2-hydroxy-4-(1-methylethyl)-

Condensed phase thermochemistry data

Data compiled by: Hussein Y. Afeefy, Joel F. Liebman, and Stephen E. Stein

Quantity Value Units Method Reference Comment
Δfsolid-340.6 ± 3.8kJ/molCcbTanaka and Watase, 1956Reanalyzed by Cox and Pilcher, 1970, Original value = -340. kJ/mol
Quantity Value Units Method Reference Comment
Δcsolid-5309.50kJ/molCcbTanaka and Watase, 1956Corresponding Δfsolid = -340.6 kJ/mol (simple calculation by NIST; no Washburn corrections)

References

Tanaka and Watase, 1956
Tanaka, T.; Watase, T., Resonance energies of tropolone and hinokitiol, Tech. Rpt., Osaka Univ., 1956, 6, 367-371. [all data]

Cox and Pilcher, 1970
Cox, J.D.; Pilcher, G., Thermochemistry of Organic and Organometallic Compounds, Academic Press, New York, 1970, 1-636. [all data]